{"text_format":"1","workbook":"xlsx","n_sheets":13,"sheets":["Traffic Generation Input Tab-1","Aux Lane Inputs-Tab 2","Left - Right Approach Example","By Pass Lane","L+Calcs","R>50+Calcs","R ≤ 50+Calcs","Left Turn Lane-Tab 3","Bypass Lane-Tab 4","Right Turn Lane R ≤ 50-Tab 5","Right Turn Lane R > 50-Tab 6","Signalized Intersection-Tab 7","Drop Lists - K&D factors - Msgs"],"not_rendered":{"charts":0,"images":7,"macros":1,"external_links":0,"defined_names":11,"comments":2,"pivot_tables":0},"unopened":[],"bounds":{"document_bytes":16777216,"sheet_cells":100000,"rows_first":2000,"rows_last":500,"rows_between":2000,"halvings":0,"cell_chars":16384,"cell_head_chars":4096},"cells_cut":0,"cells_raw":0,"read":"whole","date_system":"1900"}

{"sheet":"Traffic Generation Input Tab-1","index":0,"n_rows":37,"n_cols":23,"rows_kept":37,"cut":false,"hidden":false,"merged":[[4,12,5,12],[4,13,5,13],[6,10,8,10],[6,11,8,11],[6,12,8,12],[6,13,8,13],[4,11,5,11],[32,4,33,6],[32,7,33,8],[8,5,10,5],[8,6,10,6],[8,7,10,7],[30,7,31,8],[30,4,31,6],[21,8,22,8],[25,8,26,8],[46,1,55,11],[36,1,45,11],[21,10,22,10],[21,9,22,9],[4,10,5,10],[2,7,5,7],[2,5,5,5],[6,7,7,7],[6,5,7,5],[2,6,5,6],[6,6,7,6],[21,2,22,2],[24,6,26,6],[25,7,26,7],[21,3,22,3],[21,4,22,4]]}
["2023-04-28"]
[null,null,null,null,null,null,null,null,null,null,null,null,null,null,null,null,null,null,null,null,"No","AM / Sat",{"$f":"D22","v":0}]
[null,null,null,null,null,null,null,"[PM Peak]",null,null,null,null,null,null,null,null,null,null,null,null,"Yes","PM",{"$f":"C22","v":0}]
[null,null,null,null,null,null,null,null,null,null,null,null,null,null,null,null,null,{"$f":"IF(L5=\"No\",\"Macro 4\",\"Macro 5\")","v":"Macro 4"}]
[null,null,null,null,null,null,null,null,null,null,"RTL Channelized","No","% Reduction if Channalized",1]
[]
[null,null,null,null,null,null,null,"(AM / Sat Peak)",null,null,"Opposing Traffic Volumes Provided","No","Opposing based on [AM / Sat] / (PM)"]
[]
[null,null,null,null,null,null,null,"ADT"]
[]
[]
[null,null,null,null,null,null,null,null,null,"`"]
[]
[]
[]
[]
[null,null,null,null,null,null,null,null,null,null,null,null,null,null,null,null,"Site Right Approach ADT",null,null,null,"Calculated values"]
[null,null,null,null,null,null,null,null,null,null,null,null,null,null,null,null,"Site Left Approach ADT ","RT In + LT Out",null,null,{"$f":"I22+G9","v":0}]
[null,null,null,null,null,null,null,null,null,null,null,null,null,null,null,null,null,"LT In + RT Out",null,null,{"$f":"E22+F9","v":0}]
[null,null,null,null,null,null,null,null,null,null,null,null,null,null,null,null,"Left Approach Channelized Opossing"]
[null,null,"[PM Peak]","(AM / Sat Peak)","ADT",null,null,null,"ADT","(AM / Sat Peak)","[PM Peak]",null,null,null,null,null,"Left Approach Unchannelized Opossing","Road Peak Opposing",null,null,{"$f":"ROUNDUP(U25+U26-(U26*N5),0)","v":0}]
[null,null,null,null,null,null,null,null,null,null,null,null,null,null,null,null,null,"Road Peak Opossing + RT in Peak",null,null,{"$f":"U25+U26","v":0}]
[null,null,null,null,null,null,null,null,null,null,null,null,null,null,null,null,null,"Opposing Based on Option",null,null,{"$f":"IF(L5=\"Yes\",U21,U22)","v":0}]
[null,null,null,null,null,null,null,null,null,null,null,null,null,null,null,null,"Opp Road Peak"]
[null,null,null,null,null,null,"(10 yr) Road Peak Opp Volume","(AM / Sat Peak)","[PM Peak]",null,null,null,null,null,null,null,"RT Opp Peak",null,null,null,{"$f":"IF(N7=\"AM / Sat\",J26,K26)","v":0}]
[null,null,null,null,null,null,null,5,5,{"$f":"IF(L7=\"No\",0,H26)","v":0},{"$f":"IF(L7=\"No\",0,I26)","v":0},null,null,null,null,null,null,null,null,null,{"$f":"IF(N7=\"AM / Sat\",J22,K22)","v":0},"Base this on selected AM / PM Opposing"]
[]
[]
[null,null,null,null,null,null,null,null,null,null,null,null,null,null,null,null,null,null,null,null,{"$f":"IF(AND(I22>=0,I22<=50),\"0-50\",IF(AND(I22>50,I22<=100),\"51 - 100\",IF(AND(I22>100,I22<=200),\"101 - 200\",IF(AND(I22>200,I22<=300),\"201 - 300\",IF(AND(I22>300,I22<=400),\"301 - 400\",\"Over 400\")))))","v":"0-50"}]
[]
[null,null,null,null,"Roadway AADT From DelDOT Traffic Summary:"]
[]
[null,null,null,null,"Committed Development AADT:"]
[]
[]
[]
[null,"Notes:\n1. Fill in the volumes on the Traffic Generation Diagram tab consistent with the Traffic Generation Diagram created for the Entrance Plan.\n   i. If the proposed entrance will create the fourth leg to an existing entrance, separate Auxiliary Lane Worksheets shall be completed and submitted for review of both the proposed entrance and the existing entrance.\n   ii. If the proposed entrance will create the fourth leg to an existing T intersection (2 roads), an Auxiliary Lane Worksheet shall be completed for the proposed entrance and all other approaches will need further evaluation per the Development Coordination Manual and associated state and federal manuals (i.e. AASHTO Green Book).\n2. If the entrance is an existing access point, left turn and right turn ADT and peak hour volumes shall include site traffic and existing roadway traffic.\n3. If opposing roadway traffic volumes were collected, include in the worksheet.\n4. If the opposing right-turn movement is channelized, a reduction may be included in the worksheet. Justification for reduction shall be submitted to DelDOT Development Coordination Section for review.\n5. If Committed Development traffic information is known, include in the worksheet. This information is commonly included in a Final TIS.\n6. In the Aux Lane Inputs - Tab 2, fill in the cells with GREEN text.\n   i. If opposing roadway traffic volumes were collected and/or the opposing right- turn movement is channelized, the Left Turn VPH should be the same peak hour as the peak hour chosen for the opposing through and right turn volumes within the Traffic Generation Diagram tab.\n7. To obtain further clarification on how ADT is determined per approach, see Left-Right Approach Example tab within the DelDOT Auxiliary Lane Worksheet.\n"]

{"sheet":"Aux Lane Inputs-Tab 2","index":1,"n_rows":26,"n_cols":47,"rows_kept":26,"cut":false,"hidden":false,"merged":[[8,10,8,11],[4,6,4,9],[5,6,5,9],[6,6,6,9],[8,6,8,9],[21,0,21,3],[22,0,22,3],[9,6,9,9],[10,6,10,9],[11,6,11,9],[15,6,15,9],[16,6,16,9],[18,6,18,9],[11,0,11,3],[10,0,10,3],[19,0,19,3],[20,0,20,3],[21,4,21,5],[22,4,22,5],[17,4,17,5],[0,0,0,1],[15,0,15,3],[16,0,16,3],[18,0,18,3],[13,42,13,43],[2,30,2,34],[3,30,3,34],[4,30,4,34],[5,30,5,34],[6,30,6,34],[7,30,7,34],[8,30,8,34],[9,30,9,34],[10,30,10,34],[11,30,11,34],[11,35,11,37],[25,0,26,17],[24,0,24,11],[0,30,0,39],[1,30,1,34],[1,35,1,37],[2,35,2,37],[3,35,3,37],[4,35,4,37],[5,35,5,37],[6,35,6,37],[7,35,7,37],[8,35,8,37],[9,35,9,37],[10,35,10,37],[19,6,23,11],[23,0,23,3],[18,10,18,11],[0,29,1,29],[17,6,17,11],[1,0,1,17],[2,0,2,17],[12,6,12,11],[12,0,12,5],[3,0,3,3],[4,0,4,3],[5,0,5,3],[6,0,6,3],[8,0,8,3],[9,0,9,3],[13,0,14,3],[14,29,14,30],[3,6,3,9],[9,10,9,11],[10,10,10,11],[11,10,11,11],[16,4,16,5],[15,4,15,5],[13,4,14,5],[11,4,11,5],[10,4,10,5],[9,4,9,5],[13,6,14,9],[23,4,23,5],[20,4,20,5],[18,4,18,5],[3,10,3,11],[4,10,4,11],[5,10,5,11],[6,10,6,11],[13,10,14,11],[8,4,8,5],[6,4,6,5],[5,4,5,5],[4,4,4,5],[3,4,3,5],[16,10,16,11],[15,10,15,11],[19,4,19,5]]}
["2023-04-28",null,null,null,null,null,null,null,null,null,null,null,null,null,null,null,null,"V2020.3",null,null,null,null,null,null,null,null,null,null,null,"NO.","Special Conditions",null,null,null,null,null,null,null,null,null,null,"Active/Not Active "]
["DelDOT Auxiliary Lane Worksheet",null,null,null,null,null,null,null,null,null,null,null,null,null,null,null,null,null,null,null,null,null,null,null,null,null,null,null,null,null,"Case",null,null,null,null,"Action ",null,null,"Control Cell","Notes ","Disable"]
["Roadway Information and Entrance ",null,null,null,null,null,null,null,null,null,null,null,null,null,null,null,null,null,null,null,null,null,null,null,null,null,null,null,null,1," Number of Lanes is >4 ",null,null,null,null,"No calculations & display additional analysis required ",null,null,{"$f":"IF(E9=\"> 4 Lanes\",\"Additional Analysis Required\",\"\")","v":""},"B21",null,"working from other cells"]
["Name of Project",null,null,null,null,null,"Date of Submittal",null,null,null,null,null,null,null,null,null,null,null,null,null,null,null,null,null,null,null,null,null,null,2,"Number of Lanes is =4",null,null,null,null,"LTL required on Bypass cell and block ADT ",null,null,{"$f":"IF(E9=\"4 lanes\",1,0)","v":0},"B22",null,"Working from other cells"]
["Maintenance Road No. (i.e. K234A)",null,null,null,null,null,"Road Name",null,null,null,null,null,null,null,null,null,null,null,null,null,null,null,null,null,null,null,null,null,null,3,"Number of legs in 4 ",null,null,null,null,"LTL required and block ADT ",null,null,{"$f":"IF(K9>3,\"Bypass Not Allowed\",0)","v":0},null,null,"Working from bypass tab"]
["Signalized / Unsignalized",null,null,null,null,null,"Posted Speed Limit",null,null,null,null,null,null,null,null,null,null,null,null,null,null,null,null,null,null,null,null,null,null,4,"ADT > 8000 … no bypass",null,null,null,null,"LTL required and block ADT ",null,null,{"$f":"IF(E11>8000,\"Bypass Lane not allowed\",\"\")","v":""},null,null,"Working from bypass tab"]
["Roadway ADT\n(From DelDOT Traffic Manual)",null,null,null,{"$f":"'Traffic Generation Input Tab-1'!H31","v":0},null,"Traffic Pattern Group",null,null,null,null,null,null,null,null,null,null,null,null,null,null,null,null,null,null,null,null,null,null,5,"looks if LTL is required or if bypass not allowed",null,null,null,null,"LTL Required ",null,null,{"$f":"IF(OR('By Pass Lane'!B6=\"Bypass not Allowed\", 'By Pass Lane'!B6=\"LTL Required\"),1,0)","v":0},"IF(AND(B14>20,AND(B11>2000,B11<=4000),B20>400),1,0)",null,"Looks to see if LTL required or Bypass not allowed from Bypass sheet",null,null,{"$f":"IF(OR(E10=\"Local\",E10=\"Minor Collector\"),0,1)","v":1},null,"MINOR OR COLLECTOR "]
["Left Approach Site ADT",{"$f":"'Traffic Generation Input Tab-1'!U19","v":0},"Committed Development ADT",{"$f":"'Traffic Generation Input Tab-1'!H33","v":0},"Total Left Approach ADT",{"$f":"D8+B8","v":0},"Right Approach Site ADT",{"$f":"'Traffic Generation Input Tab-1'!U18","v":0},"Committed Development ADT",{"$f":"D8","v":0},"Total Right Approach ADT",{"$f":"J8+H8","v":0},null,null,null,null,null,null,null,null,null,null,null,null,null,null,null,null,null,6,"LTL: vph > 30 prjvted >200 - ≤ 400 , >2000 - ≤4000",null,null,null,null,"LTL required",null,null,null,"IF(AND(B14>30,AND(B11>2000,B11<=4000),AND(B20>200,B20<=400)),1,0)",null,"Not Active",null,null,{"$f":"IF(AND($AS$7=1,$E$20<2000,$F$15>=20,F15<=50),\"LTL Required\",0)","v":0},null,"check it, it says display LTL if MINOR OR LOCAL and 2000 (check what is the 2000 is it ops vol or ADT or projected ADT ) and 20 to 50 vph … see what is the new range "]
["Total Number of Through Lanes\n(Does Not Include Turn Lanes)",null,null,null,null,null,"Number of intersection legs",null,null,null,null,null,null,null,null,null,null,null,null,null,null,null,null,null,null,null,null,null,null,7,"LTL : vph >40 - ADT ≥ 1500 and ≤ 2000",null,null,null,null,"LTL required ",null,null,null,"IF(AND(B14>40,AND(B11>=1500,B11<=2000)),1,0)",null,"Not Active"]
["Roadway Functional Classification",null,null,null,null,null,"Calculation for (specify leg)",null,null,null,null,null,null,null,null,null,null,null,null,null,null,null,null,null,null,null,null,null,null,8,"LTL : vph > 40 AADT >2000 - ≤4000 - 10 yrs opposing ≤200",null,null,null,null,"LTL required ",null,null,null,"IF(AND(B14>40,AND(B11>2000,B11<=4000),B20<=200),1,0)",null,"Not Active"]
["Left-Approach Projected 10 yr Roadway ADT + Total Site + Committed Development ADT",null,null,null,{"$f":"ROUNDDOWN(F8+(E7*1.16),0)","v":0},null,"Right-Approach Projected 10 yr Roadway ADT + Total Site + Committed Development ADT",null,null,null,{"$f":"ROUNDDOWN(L8+(E7*1.16),0)","v":0},null,null,null,null,null,null,null,null,null,null,null,null,null,null,null,null,null,null,9,"LTL : vph 15-50 AADT >4000 <=8000",null,null,null,null,"LTL required ",null,null,null,"IF(AND(B14>=15,B14<=50,AND(B11>4000,B11<=8000)),1,0)",null,"Not Active"]
["K Factor",null,null,null,{"$f":"VLOOKUP(K7,'Drop Lists - K&D factors - Msgs'!C21:D26,2)","v":{"$error":"#N/A"}},null,"D Factor",null,null,null,{"$f":"VLOOKUP(K7,'Drop Lists - K&D factors - Msgs'!C21:E26,3)","v":{"$error":"#N/A"}},null,null,null,null,null,null,null,null,null,null,null,null,null,null,null,null,null,null,10,"LTL <= 1200",null,null,null,null,"LTL required ",null,null,{"$f":"IF(E14<=1200,1,0)","v":1},null,{"$f":"IF(AND(E16>=5,E16<=50,E11>=6000),\"LTL Required\",0)","v":0},"Active"]
["Left Turn Information",null,null,null,null,null,"Right Turn Information",null,null,null,null,null,null,null,null,null,null,null,null,null,null,null,null,null,null,null,null,null,null,null,null,null,null,null,null,null,null,null,{"$f":"IF(AND(AM12=1,OR(AM11=1,AM10=1,AM9=1,AM8=1,AM7=1)),1,0)","v":0},{"$f":"IF(AND(OR(AO9=\"LTL Required\",AO10=\"LTL Required\",AO11=\"LTL Required\"),E22=\"Bypass not Required\"),1,0)","v":0}]
["Left Turn VPH",null,null,null,null,null,"Right Turn ADT",null,null,null,{"$f":"'Traffic Generation Input Tab-1'!U29","v":"0-50"},null,null,null,null,null,null,null,null,null,null,null,null,null,null,null,null,null,null,null,null,null,null,null,null,null,null,null,null,null,null,null,"Sketch"]
[null,null,null,null,null,null,null,null,null,null,null,null,null,null,null,null,null,null,null,null,null,null,null,null,null,null,null,null,null,"Messages",null,null,null,null,null,null,null,null,null,null,null,{"$f":"IF(K$19=\"RTL Not Required\",\"RTL Not Required\",AP17+50)","v":{"$error":"#N/A"}},{"$f":"IFERROR(AP15,\"X\")","v":"X"},"RTL"]
["Left Turn Approach Grade",null,null,null,null,null,"Right Turn Approach Grade",null,null,null,null,null,null,null,null,null,null,null,null,null,null,null,null,null,null,null,null,null,null,"RTL MSG",{"$f":"IF(K14=\"\",\"Select Right Turn ADT\",IF(K16=\"\",\"Select Right Turn Approach grade\",IF(ABS(K16*100)>9,\"Right Turn Approach Grade Excessive\",IF(K17=\"\",\"Select Right Turn Effective Radius\",\"\"))))","v":"Select Right Turn Approach grade"},null,null,"RTL Total",null,"LTL Total",null,null,null,null,null,{"$f":"IF(G20<>\"\",\"X\",IF(E21=\"Low Volume LTL Not Required\",\"X\",IF(E21=\"Additional Analysis Required\",\"X\",IF(E21=\"Signal Required\",\"X\",IF(E21=\"LTL Not Required\",\"X\",(E21-100)/2)))))","v":"X"},{"$f":"IFERROR(AP16,\"X\")","v":"X"},"LTL "]
["Heavy Vehicle %",null,null,null,null,null,"Effective Radius of Entrance",null,null,null,null,null,null,null,null,null,null,null,null,null,null,null,null,null,null,null,null,null,null,"LTL MSG",{"$f":"IF(OR('Aux Lane Inputs-Tab 2'!E6=\"-\",E6=\"\"),\"Select if Signalized / Unsignalized\",IF('Aux Lane Inputs-Tab 2'!K6=\"\",\"Select the posted speed limit\",IF('Aux Lane Inputs-Tab 2'!E7=\"\",\"Input Roadway ADT\",IF('Aux Lane Inputs-Tab 2'!K7=\"\",\"Select Traffic Pattern Group\",IF('Aux Lane Inputs-Tab 2'!E9=\"\",\"Select the total number of through Lanes\",IF('Aux Lane Inputs-Tab 2'!K9=\"\",\"Select the number of intersection legs\",IF('Aux Lane Inputs-Tab 2'!E10=\"\",\"Select the Roadway Functional Classification\",IF(E14=\"\",\"Input Left Turn Lane VPH\",IF('Aux Lane Inputs-Tab 2'!E16=\"\",\"Select Approach grade\",IF(ABS('Aux Lane Inputs-Tab 2'!E16*100)>9,\"Approach Grade Excessive\",IF('Aux Lane Inputs-Tab 2'!E17=\"\",\"Select Heavy Vehicle %\",\"\")))))))))))","v":"Select if Signalized / Unsignalized"},null,null,{"$f":"IF('Aux Lane Inputs-Tab 2'!$K$17=\"R>50'\",'R>50+Calcs'!H2,'R ≤ 50+Calcs'!$H$2)","v":{"$error":"#N/A"}},null,{"$f":"IF(AND(E11<1500,E20<100),\"LTL Not Required\",CEILING('L+Calcs'!C10,5))","v":0},null,null,null,null,{"$f":"IF(K19=\"RTL Not Required\",\"X\",IF(K17=\"R>50'\",'R>50+Calcs'!$H$2-50,'R ≤ 50+Calcs'!$H$2-50))","v":{"$error":"#N/A"}},{"$f":"IF(AO17>0,AO17,\"X\")","v":{"$error":"#N/A"}},"X","RTL"]
["10 Yr Opposing Vol. (Manual Input - Veh/hr)",null,null,null,{"$f":"IF('Traffic Generation Input Tab-1'!L7=\"Yes\",'Traffic Generation Input Tab-1'!U23,)","v":0},null,null,null,null,null,null,null,null,null,null,null,null,null,null,null,null,null,null,null,null,null,null,null,null,"Comb MSG",{"$f":"IFERROR(AF18,IF(AE16<>\"\",AE17&\" \"&\"&\"&\" \"&AE16,AE17))","v":"X"},{"$f":"IF(AE19<>\"\",\"X\",IF(AND(AE16<>\"\",AE17=\"\"),AE16,IF(AND(AE17<>\"\",AE16=\"\"),AE17,IF(AND(AE17<>\"\",AE16<>\"\"),AE17&\" \"&\"&\"&\" \"&AE16,IF(OR(E22=\"Bypass not Required\",AND(E22=\"LTL Required\",AJ17=\"LTL Not Required\"),AND(E22=\"Bypass not Allowed\",E21=\"\")),\"Bypass and Left Turn Lanes are not required\",IF(AND(E22=\"Bypass not allowed\",AJ17=0),\"Bypass and Left turn lane are not required\",IF(AND(E20>=1200,OR(E22=\"Bypass not Allowed\",E22=\"LTL Required\")),\"The Engineer Shall submit an intersection and traffic signal analysis to DelDOT\",IF(AND(E9<>\"2 Lanes\",AJ17=0),\"Contact DelDOT, Refer to 5.2.9.2.A.5\",IF(E6=\"Signalized\",\"Refer to Tab-6 for Signalized intersection\",\"\")))))))))","v":"X"},null,null,null,null,null,null,null,null,{"$f":"IF(K19=\"RTL Not Required\",\"X\",AP17/2)","v":{"$error":"#N/A"}},{"$f":"MROUND(AO18,5)","v":{"$error":"#N/A"}},{"$f":"IFERROR(AP18,\"X\")","v":"X"},"RTL without taper "]
["10 Yr Opposing Volume (Calculated)",null,null,null,{"$f":"IF(E14=\"\",\"\",(E7*1.16)*(E12/100)*(K12/100))","v":""},null,"Right Turn Length",null,null,null,{"$f":"IF(AH17>0,AH17,\"RTL Not Required\")","v":{"$error":"#N/A"}},null,null,null,null,null,null,null,null,null,null,null,null,null,null,null,null,null,null,"AD MSG",{"$f":"IF(E6=\"Signalized\",\"Signalized intersection: Refer to Tab-6\",IF(E20>=1200,\"The Engineer shall contact DelDOT Development Coordination section.\",IF(E14>400,\"The Engineer shall contact DelDOT Development Coordination section.\",IF(E9=\"> 4 Lanes\",\"The Engineer shall contact DelDOT Development Coordination section.\",\"\"))))","v":"The Engineer shall contact DelDOT Development Coordination section."},null,null,null,null,null,null,null,null,null,null,{"$f":"IF(OR(E22=\"Additional Analysis Required\",E22=\"Bypass Not Allowed\",E22=\"LTL Required\",E22=\"Bypass Not Required\"),\"X\",E22)","v":"X"},"X","Bypass approach Taper "]
[{"$f":"IF(E20=E19,\"10 Yr Opposing Volume (Calculated Vol.)\",\"10 Yr Opposing Volume (Manual Input)\")","v":"10 Yr Opposing Volume (Calculated Vol.)"},null,null,null,{"$f":"IF((E18>0),E18,E19)","v":""},null,{"$f":"AE18","v":"X"},null,null,null,null,null,null,null,null,null,null,null,null,null,null,null,null,null,null,null,null,null,null,null,null,null,null,null,null,null,null,null,null,null,null,{"$f":"IF(OR(E22=\"Additional Analysis Required\",E22=\"Bypass Not Allowed\",E22=\"LTL Required\",E22=\"Bypass Not Required\"),\"X\",E23)","v":"X"},"X","Bypass departure taper"]
["Left Turn Length ",null,null,null,{"$f":"IF((AM13=1),AJ17,IF(OR(AND(AM13=1,OR(E22=\"LTL Required\",E22=\"Bypass not Allowed\"),K9=4)),AJ17,\"\"))","v":""},null,null,null,null,null,null,null,null,null,null,null,null,null,null,null,null,null,null,null,null,null,null,null,null,null,null,null,null,null,null,null,null,null,null,null,null,{"$f":"IF(OR(E22=\"Additional Analysis Required\",E22=\"Bypass Not Allowed\",E22=\"LTL Required\",E22=\"Bypass Not Required\"),\"X\",E24-25)","v":"X"},"X","Bypass Storage - 25"]
["Bypass Lane Approach Taper",null,null,null,{"$f":"IF(E24=\"Bypass not Required\",\"Bypass not Required\",IF(E24=\"Bypass not Allowed\",\"Bypass not Allowed\",IF(E24=\"LTL Required\",\"LTL Required\",'By Pass Lane'!B7)))","v":"Bypass not Required"},null,null,null,null,null,null,null,null,null,null,null,null,null,null,null,null,null,null,null,null,null,null,null,null,null,null,null,null,null,null,null,null,null,null,null,null,{"$f":"IF(OR(E22=\"Additional Analysis Required\",E22=\"Bypass Not Allowed\",E22=\"LTL Required\",E22=\"Bypass Not Required\"),\"X\",E24+E22+E23)","v":"X"},"X","Bypass"]
["Bypass Lane Departure Taper",null,null,null,{"$f":"IF(E24=\"Bypass not Required\",\"Bypass not Required\",IF(E24=\"Bypass not Allowed\",\"Bypass not Allowed\",IF(E24=\"LTL Required\",\"LTL Required\",'By Pass Lane'!B8)))","v":"Bypass not Required"},null,null,null,null,null,null,null,null,null,null,null,null,null,null,null,null,null,null,null,null,null,null,null,null,null,null,null,null,null,null,null,null,null,null,null,null,{"$f":"E21","v":""},{"$f":"IFERROR(AP23,\"X\")","v":""},"LTL "]
["Bypass Lane Storage",null,null,null,{"$f":"'By Pass Lane'!B6","v":"Bypass not required"},null,null,null,null,null,null,null,null,null,null,null,null,null,null,null,null,null,null,null,null,null,null,null,null,null,null,null,null,null,null,null,null,null,null,null,null,{"$f":"IF(AND(K9=4,AE18=\"\",OR(K10=\"Proposed Entrance 1\",K10=\"Proposed Entrance 2\")),\"The Engineer shall submit a separate spreadsheet for the existing entrance.\",\"\")","v":""},{"$f":"IFERROR(AP24,\" \")","v":""},"4th leg warning"]
[{"$f":"AE19","v":"The Engineer shall contact DelDOT Development Coordination section."}]
["NOTE: \nThis worksheet is for Right Turn Auxiliary Lanes, and Unsignalized Left Turn Auxiliary Lanes.  If a signal analysis is required, please refer to signalized intersection analysis spreadsheet (Tab 6). \n*L1 - See Typical Entrance Diagram located at: http://www.deldot.gov/information/business/subdivisions/Typical_Entrance_Diagrams.pdf\n"]

{"sheet":"Left - Right Approach Example","index":2,"n_rows":0,"n_cols":0,"rows_kept":0,"cut":false,"hidden":false,"merged":[]}

{"sheet":"By Pass Lane","index":3,"n_rows":103,"n_cols":21,"rows_kept":103,"cut":false,"hidden":true,"merged":[[89,0,97,0],[89,2,89,8],[90,2,90,8],[91,1,97,1],[91,2,96,8],[69,0,77,0],[69,2,69,8],[70,2,70,8],[71,1,77,1],[71,2,76,8],[51,0,59,0],[51,2,51,8],[52,2,52,8],[53,1,59,1],[33,2,37,8],[54,2,58,8],[30,0,38,0],[30,2,30,8],[31,2,31,8],[32,1,38,1],[15,1,21,1],[13,0,21,0],[14,2,14,8],[13,2,13,8],[15,2,20,8]]}
[]
["Projected 10-Year Opposing Volume (vph)",{"$f":"'Aux Lane Inputs-Tab 2'!E20","v":""},null,null,"Roadway ADT",{"$f":"'Aux Lane Inputs-Tab 2'!E11","v":0},null,"Roadway ADT",{"$f":"IF(F2<1500,\"<1500\",IF(AND(F2>=1500,F2<=2000),\"1500-2000\",IF(AND(F2>2000,F2<=4000),\"2000-4000\",IF(AND(F2>4000,F2<=8000),\"4000-8000\",IF(F2>8000,\">8000\",\"ERROR\")))))","v":"<1500"},null,null,null,null,null,null,null,"0-100"]
["LTL VPH",{"$f":"'Aux Lane Inputs-Tab 2'!E14","v":0},null,null,"Number of legs",{"$f":"'Aux Lane Inputs-Tab 2'!K9","v":0},null,"LTL VPH",{"$f":"IF(B3<5,\"Less than 5\",IF(AND(B3>=5,B3<=9),\"5 to 9\",IF(AND(B3>=10,B3<=14),\"10 to 14\",IF(AND(B3>14,B3<=20),\"15-20\",IF(AND(B3>20,B3<=30),\"21-30\",IF(AND(B3>30,B3<=40),\"31-40\",IF(B3>40,\"Over 40\",\"ERROR\")))))))","v":"Less than 5"},null,null,null,null,null,null,null,"101-200"]
["Speed Limit",{"$f":"'Aux Lane Inputs-Tab 2'!K6","v":0},null,null,"Road Class",{"$f":"'Aux Lane Inputs-Tab 2'!E10","v":0},null,"Projected 10-Year Opposing Volume (vph)",{"$f":"IF(AND(B2>=0,B2<=100),\"0-100\",IF(AND(B2>100,B2<=200),\"101-200\",IF(AND(B2>200,B2<=300),\"201-300\",IF(AND(B2>300,B2<=400),\"301-400\",\">400\"))))","v":">400"},null,null,null,null,null,null,null,"201-300"]
[null,null,null,null,"No. of Lanes",{"$f":"'Aux Lane Inputs-Tab 2'!E9","v":0},null,null,null,null,null,null,null,null,null,null,"301-400"]
["Storage Length",{"$f":"IF(AND(B4=25,(K6=\"LTL\")),\"LTL Required\",IF(B4=25,\"Bypass not Required\",IF(B7=\"LTL Required\",\"LTL Required\",IF(K6=\"LTL\",\"LTL Required\",IF(AND(K6<>\"Bypass not required\",OR(F3=4,F5<>\"2 Lanes\")),\"Bypass not Allowed\",IF(U14=\"LTL\",\"LTL Required\",IF(B7=\"Bypass not Required\",\"Bypass not Required\",K6)))))))","v":"Bypass not required"},"IF(B4=25,\"Bypass not Required\",IF(B7=\"LTL Required\",\"LTL Required\",IF(K6=\"LTL\",\"LTL Required\",IF(OR(AND(F2>=4000,B3>=15),F3=4,F4=\"Other Freeway / Expressway\",F5<>\"2 Lanes\"),\"Bypass not Allowed\",IF(U14=\"LTL\",\"LTL Required\",IF(B7=\"Bypass not Required\",\"Bypass not Required\",IF(B3>=50,\"LTL Required\",K6)))))))",null,null,null,null,null,null,"Storage Length ",{"$f":"IF(I2=\"<1500\",K14,IF(I2=\"1500-2000\",K31,IF(I2=\"2000-4000\",K52,IF(I2=\"4000-8000\",K70,IF(I2=\">8000\",K90)))))","v":"Bypass not required"},null,null,null,null,null,">400"]
["App.Taper Length",{"$f":"IFERROR(IF(T14=\"-\",\"Bypass not Required\",IF(T14=\"LTL\",\"LTL Required\",T14)),0)","v":0}]
["Departure Taper",{"$f":"IFERROR(IF(T31=\"-\",\"Bypass not Required\",IF(T31=\"LTL\",\"LTL Required\",T31)),0)","v":0}]
[]
[]
[]
[]
[]
["Projected 10-year Roadway ADT",null,"Storage Length (feet)",null,null,null,null,null,null,null,{"$f":"IF(I2=\"<1500\",INDEX(C23:I27,MATCH(I$4,B23:B27,),MATCH(I$3,C22:I22,)),0)","v":"Bypass not required"},null,null,null,null,"Posted Speed (mph)","Approach Taper  Length (feet)",null,null,{"$f":"VLOOKUP(B4,P17:Q23,2)","v":{"$error":"#N/A"}},{"$f":"IFERROR(INDEX(Q17:R23,MATCH(B4,P17:P23,),MATCH(K6,Q16:R16,)),0)","v":0}]
[null,null,"Left-Turning Vehicles (vph)",null,null,null,null,null,null,null,null,null,null,null,null,null,"Storage Length (feet)"]
[null,"Projected 10-Year Opposing Volume (vph)","<1500"]
[null,null,null,null,null,null,null,null,null,null,null,null,null,null,null,25,"-"]
[null,null,null,null,null,null,null,null,null,null,null,null,null,null,null,30,125]
[null,null,null,null,null,null,null,null,null,null,null,null,null,null,null,35,155]
[null,null,null,null,null,null,null,null,null,null,null,null,null,null,null,40,155]
[null,null,null,null,null,null,null,null,null,null,null,null,null,null,null,45,180]
[null,null,"Less than 5","5 to 9","10 to 14","15-20","21-30","31-40","Over 40",null,null,null,null,null,null,50,215]
["<1500","0-100","Bypass not required","Bypass not required","Bypass not required","Bypass not required","Bypass not required","Bypass not required","Bypass not required",null,null,null,null,null,null,55,250]
[null,"101-200","Bypass not required","Bypass not required","Bypass not required","Bypass not required",50,50,50]
[null,"201-300","Bypass not required","Bypass not required","Bypass not required","Bypass not required",50,50,50]
[null,"301-400","Bypass not required","Bypass not required","Bypass not required","Bypass not required",50,50,50]
[null,">400","Bypass not required","Bypass not required","Bypass not required","Bypass not required",50,50,50]
[]
[]
[]
["Projected 10-year Roadway ADT",null,"Storage Length (feet)",null,null,null,null,null,null,null,{"$f":"IF(I2=\"1500-2000\",INDEX(C40:I44,MATCH(I$4,B40:B44,),MATCH(I$3,C39:I39,)),0)","v":0},null,null,null,null,"Posted Speed (mph)","Departure Taper  Length (feet)",null,null,{"$f":"VLOOKUP(B4,P34:Q40,2)","v":{"$error":"#N/A"}},{"$f":"IFERROR(INDEX(Q35:S41,MATCH(B4,P34:P40,),MATCH(K6,Q34:S34,)),0)","v":0}]
[null,null,"Left-Turning Vehicles (vph)",null,null,null,null,null,null,null,null,null,null,null,null,null,"Storage Length (feet)"]
[null,"Projected 10-Year Opposing Volume (vph)"]
[null,null,"1500 - 2000",null,null,null,null,null,null,null,null,null,null,null,null,25,"-"]
[null,null,null,null,null,null,null,null,null,null,null,null,null,null,null,30,65]
[null,null,null,null,null,null,null,null,null,null,null,null,null,null,null,35,80]
[null,null,null,null,null,null,null,null,null,null,null,null,null,null,null,40,80]
[null,null,null,null,null,null,null,null,null,null,null,null,null,null,null,45,90]
[null,null,"Less than 5","5 to 9","10 to 14","15-20","21-30","31-40","Over 40",null,null,null,null,null,null,50,110]
[null,"0-100","Bypass not required","Bypass not required","Bypass not required",50,50,50,"LTL",null,null,null,null,null,null,55,125]
[null,"101-200","Bypass not required","Bypass not required","Bypass not required",50,50,50,"LTL"]
[null,"201-300","Bypass not required","Bypass not required","Bypass not required",50,50,50,"LTL"]
[null,"301-400","Bypass not required","Bypass not required","Bypass not required",50,50,50,"LTL"]
[null,">400","Bypass not required","Bypass not required","LTL","LTL","LTL","LTL","LTL"]
[]
[]
[]
[]
[]
[]
[]
["Projected 10-year Roadway ADT",null,"Storage Length (feet)",null,null,null,null,null,null,null,{"$f":"IF(I2=\"2000-4000\",INDEX(C61:I65,MATCH(I4,B61:B65,),MATCH(I3,C60:I60,)),0)","v":0}]
[null,null,"Left-Turning Vehicles (vph)"]
[null,"Projected 10-Year Opposing Volume (vph)"]
[null,null,"2000-4000"]
[]
[]
[]
[]
[null,null,"Less than 5","5 to 9","10 to 14","15-20","21-30","31-40","Over 40"]
[null,"0-100","Bypass not required","Bypass not required",50,50,50,50,"LTL"]
[null,"101-200","Bypass not required","Bypass not required",50,50,50,50,"LTL"]
[null,"201-300","Bypass not required","Bypass not required",50,50,50,"LTL","LTL"]
[null,"301-400","Bypass not required","Bypass not required",50,50,50,"LTL","LTL"]
[null,">400","Bypass not required","Bypass not required",75,75,"LTL","LTL","LTL"]
[]
[]
[]
[]
["Projected 10-year Roadway ADT",null,"Storage Length (feet)",null,null,null,null,null,null,null,{"$f":"IF(I2=\"4000-8000\",INDEX(C79:I83,MATCH(I4,B79:B83,),MATCH(I3,C78:I78,)),0)","v":0}]
[null,null,"Left-Turning Vehicles (vph)"]
[null,"Projected 10-Year Opposing Volume (vph)","4000-8000"]
[]
[]
[]
[]
[]
[null,null,"Less than 5","5 to 9","10 to 14","15-20","21-30","31-40","Over 40"]
[null,"0-100","Bypass not required","Bypass not required",75,"LTL","LTL","LTL","LTL"]
[null,"101-200","Bypass not required","Bypass not required",75,"LTL","LTL","LTL","LTL"]
[null,"201-300","Bypass not required","Bypass not required",75,"LTL","LTL","LTL","LTL"]
[null,"301-400","Bypass not required","Bypass not required",75,"LTL","LTL","LTL","LTL"]
[null,">400","Bypass not required","Bypass not required",75,"LTL","LTL","LTL","LTL"]
[]
[]
[]
[]
[]
[]
["Projected 10-year Roadway ADT",null,"Storage Length (feet)",null,null,null,null,null,null,null,{"$f":"IF(I2=\">8000\",INDEX(C99:I103,MATCH(I4,B99:B103,),MATCH(I3,C98:I98,)),0)","v":0}]
[null,null,"Left-Turning Vehicles (vph)"]
[null,"Projected 10-Year Opposing Volume (vph)",">8000"]
[]
[]
[]
[]
[]
[null,null,"Less than 5","5 to 9","10 to 14","15-20","21-30","31-40","Over 40"]
[null,"0-100","Bypass not required","Bypass not required","LTL","LTL","LTL","LTL","LTL"]
[null,"101-200","Bypass not required","Bypass not required","LTL","LTL","LTL","LTL","LTL"]
[null,"201-300","Bypass not required","Bypass not required","LTL","LTL","LTL","LTL","LTL"]
[null,"301-400","Bypass not required","Bypass not required","LTL","LTL","LTL","LTL","LTL"]
[null,">400","Bypass not required","Bypass not required","LTL","LTL","LTL","LTL","LTL"]

{"sheet":"L+Calcs","index":4,"n_rows":171,"n_cols":83,"rows_kept":171,"cut":false,"hidden":true,"merged":[[104,2,104,13],[146,2,146,13],[159,2,159,13],[160,2,160,13],[117,2,117,13],[118,2,118,13],[131,2,131,13],[132,2,132,13],[145,2,145,13],[75,2,75,13],[76,2,76,13],[89,2,89,13],[90,2,90,13],[103,2,103,13],[0,46,0,51],[1,25,4,25],[1,26,1,37],[1,46,1,51],[5,44,5,45],[3,26,3,37],[4,44,4,45],[18,64,19,64],[18,65,19,65],[19,0,26,1],[19,44,19,45],[15,44,15,45],[16,0,16,8],[16,26,16,37],[16,44,16,45],[17,44,17,45],[15,0,15,8],[42,47,42,61],[41,46,43,46],[13,0,13,8],[13,44,13,45],[33,0,35,0],[33,2,33,13],[34,2,34,13],[14,44,14,45],[28,50,28,63],[29,50,29,63],[17,63,19,63],[18,0,18,8],[18,44,18,45],[27,0,28,1],[11,44,11,45],[12,44,12,45],[47,0,49,0],[15,25,17,25],[15,26,15,37],[29,26,29,37],[6,44,6,45],[7,44,7,45],[8,44,8,45],[9,44,9,45],[10,44,10,45],[61,0,63,0],[28,25,30,25],[28,26,28,37],[56,25,58,25],[56,26,56,37],[57,26,57,37],[43,26,43,37],[42,25,44,25],[42,26,42,37],[61,2,61,13],[62,2,62,13],[47,2,47,13],[48,2,48,13],[3,64,3,82],[126,25,128,25],[126,26,126,37],[127,26,127,37],[112,25,114,25],[112,26,112,37],[113,26,113,37],[85,26,85,37],[98,25,100,25],[98,26,98,37],[99,26,99,37],[70,25,72,25],[70,26,70,37],[71,26,71,37],[84,25,86,25],[84,26,84,37]]}
["2000-4000","Roadway ADT",4000,{"$f":"C1*('Aux Lane Inputs-Tab 2'!$E12/100)*('Aux Lane Inputs-Tab 2'!$K12/100)","v":{"$error":"#N/A"}},2000,{"$f":"E1*('Aux Lane Inputs-Tab 2'!$E12/100)*('Aux Lane Inputs-Tab 2'!$K12/100)","v":{"$error":"#N/A"}},null,null,null,null,null,null,null,null,null,null,null,null,null,null,null,null,null,null,null,"Critical Headway (sec) = 4.2",null,null,null,null,null,null,null,null,null,null,null,null,null,null,null,null,null,null,null,null,"Deceleration Length (feet) = Brake Reaction + Braking Distance"]
[null,"Critical Headway",{"$f":"IF('Aux Lane Inputs-Tab 2'!E9=\"2 lanes\",VLOOKUP('Aux Lane Inputs-Tab 2'!E17,AN5:AO11,2),IF('Aux Lane Inputs-Tab 2'!E9=\"4 lanes\",VLOOKUP('Aux Lane Inputs-Tab 2'!E17,'L+Calcs'!AN5:AP11,3)))","v":false},null,null,null,null,null,null,null,null,null,null,null,null,null,null,null,null,null,null,null,null,null,null,"Left-Turning Vehicles (in vph)","TRR 1500 - Lengths of Left-Turn Lanes at Unsignalized Intersections*",null,null,null,null,null,null,null,null,null,null,null,null,null,"Critical Headway, tc",null,null,null,null,null,"Posted Speed (mph)"]
[null,"Left Turn (vph)",{"$f":"'Aux Lane Inputs-Tab 2'!E14","v":0}]
[null,"Left Turn Rounded",{"$f":"IF(C3<5,0,((IF(AND(C3>=5,C3<=50,D5>D1),50,(IF(AND(C3>=20,C3<50,D5>=F1),50,(IF(AND(C3>=10,C3<50,F1>=D5>=D1),50,MROUND('Aux Lane Inputs-Tab 2'!E14,50)))))))))","v":0},null,null,null,null,null,null,null,null,null,null,null,null,null,null,null,null,null,null,null,null,null,null,null,"Opposing Volume (in vph)",null,null,null,null,null,null,null,null,null,null,null,null,"%HV","2 lanes","4 lanes",null,null,null,null,25,35,40,45,50,55,null,null,null,null,null,null,null,null,null,null,null,"Posted Speed (mph)/Grade","DECELERATION  (Feet)*"]
[null,"Opposing Volume Rounded",{"$f":"MROUND('Aux Lane Inputs-Tab 2'!E20,100)","v":{"$error":"#VALUE!"}},{"$f":"'Aux Lane Inputs-Tab 2'!E20","v":""},null,null,null,null,null,null,null,null,null,null,null,null,null,null,null,null,null,null,null,null,null,null,100,200,300,400,500,600,700,800,900,1000,1100,1200,null,5,4.2,4.2,null,null,"Brake reaction distance (ft)",null,44.1,58.8,58.8,66.150000000000006,73.5,80.849999999999994,null,null,null,null,null,null,null,null,null,null,null,"Grade",-1,-2,-3,-4,-5,-6,-7,-8,-9,0,1,2,3,4,5,6,7,8,9]
[null,"Speed Limit",{"$f":"'Aux Lane Inputs-Tab 2'!K6","v":0},null,null,null,null,null,null,null,null,null,null,null,null,null,null,null,null,null,null,null,null,null,null,50,1,1,1,2,2,2,2,2,2,3,3,3,null,10,4.2,4.3,null,null,"Braking distance downgrade 3% (ft)",null,94.391244870041064,128.47697218422255,128.47697218422255,167.80665754673967,212.3803009575924,262.19790241678072,null,null,null,null,null,null,null,null,null,null,null,25,131,131,139,142,145,149,153,157,161,131,131,131,124,122,120,118,116,115,113]
[null,"Slope",{"$f":"IF(-3<='Aux Lane Inputs-Tab 2'!E16*100<=3,0,ROUND('Aux Lane Inputs-Tab 2'!E16*100,0))","v":0},null,null,null,null,null,null,null,null,null,null,null,null,null,null,null,null,null,null,null,null,null,null,100,1,1,2,2,2,3,3,3,3,3,4,4,null,20,4.3,4.5,null,null,"Braking distance downgrade 4% (ft)",null,97.457627118644083,132.65065913371001,132.65065913371001,173.25800376647837,219.27966101694918,270.71563088512244,null,null,null,null,null,null,null,null,null,null,null,30,168.84583333333336,168.84583333333336,179.92697218422254,184.10065913371,188.55462287104623,193.31807653575027,198.42443922796036,203.91212121212124,209.82549184935363,168.84583333333336,168.84583333333336,168.84583333333336,159.52441503644039,156.73774289985053,154.09116575591986,151.57437810945277,149.17806104751995,146.89376693766937,144.71381992717644]
[null,"Decel Dist",{"$f":"INDEX(BL5:CE12,MATCH(C6,BL5:BL12,),MATCH(C7,BL5:CE5,))","v":{"$error":"#N/A"}},null,null,null,null,null,null,null,null,null,null,null,null,null,null,null,null,null,null,null,null,null,null,150,1,2,2,2,3,3,3,4,4,4,5,5,null,30,4.4000000000000004,4.7,null,null,"Braking distance downgrade 5% (ft)",null,100.7299270072993,137.10462287104625,137.10462287104625,179.07542579075428,226.6423357664234,279.8053527980536,null,null,null,null,null,null,null,null,null,null,null,35,177,177,188,192,196,201,206,212,218,177,177,177,167,165,162,159,157,155,153]
[null,"Storage",{"$f":"SUM(O36:O162)","v":0},null,null,null,null,null,null,null,null,null,null,null,null,null,null,null,null,null,null,null,null,null,null,200,1,2,2,3,3,4,4,4,5,5,6,6,null,40,4.5,4.9000000000000004,null,null,"Braking distance downgrade 6% (ft)",null,104.22960725075532,141.86807653575028,141.86807653575028,185.29707955689832,234.51661631419947,289.52668680765368,null,null,null,null,null,null,null,null,null,null,null,40,177,177,188,192,196,201,206,212,218,177,177,177,167,165,162,159,157,155,153]
[null,"Left Turn Length",{"$f":"IF(C9=0,0,SUM(C8:C9))","v":0},{"$f":"CEILING(C10,5)","v":0},null,null,null,null,null,null,null,null,null,null,null,null,null,null,null,null,null,null,null,null,null,250,2,2,3,3,4,4,4,5,5,6,7,8,null,50,4.5999999999999996,5.0999999999999996,null,null,"Braking distance downgrade 7% (ft)",null,107.98122065727701,146.97443922796037,146.97443922796037,191.9666145018258,242.95774647887328,299.94783515910279,null,null,null,null,null,null,null,null,null,null,null,45,220,220,234,240,246,252,259,266,274,220,220,220,208,204,201,197,194,191,188]
[null,null,null,null,null,null,null,null,null,null,null,null,null,null,null,null,null,null,null,null,null,null,null,null,null,300,2,2,3,3,4,4,5,6,6,7,8,10,null,70,4.8,5.5,null,null,"Braking distance downgrade 8% (ft)",null,112.01298701298704,152.46212121212125,152.46212121212125,199.13419913419918,252.02922077922085,311.14718614718623,null,null,null,null,null,null,null,null,null,null,null,50,268,268,286,293,301,309,317,326,336,268,268,268,253,248,244,240,236,232,228]
[null,null,null,null,null,null,null,null,null,null,null,null,null,null,null,null,null,null,null,null,null,null,null,null,null,350,2,2,3,4,4,5,6,6,7,8,10,12,null,null,null,null,null,null,"Braking distance downgrade 9% (ft)",null,116.35750421585165,158.37549184935364,158.37549184935364,206.85778527262514,261.80438448566622,323.2152894884768,null,null,null,null,null,null,null,null,null,null,null,55,321,321,344,352,361,371,381,392,405,321,321,321,302,296,291,286,281,276,272]
[null,null,null,null,null,null,null,null,null,null,null,null,null,null,null,null,null,null,null,null,null,null,null,null,null,400,2,3,3,4,5,5,6,7,8,10,12,15,null,null,null,null,null,null,"Braking distance on level (ft)",null,86.38,117.578,117.578,153.571,194.363,239.95529999999999,null,null,null,null,null,null,null,null,null,null,null,null,"D = Downgrade"]
["LEFT-TURN LANE LENGTH AT UNSIGNALIZED INTERSECTIONS",null,null,null,null,null,null,null,null,null,null,null,null,null,null,null,null,null,null,null,null,null,null,null,null,null,null,null,null,null,null,null,null,null,null,null,null,null,null,null,null,null,null,null,"Braking distance upgrade 3% (ft)",null,79.401611047180694,108.07441503644039,108.07441503644039,141.15841963943234,178.65362485615654,220.56003068661303,null,null,null,null,null,null,null,null,null,null,null,null,"U = Upgrade"]
[null,null,null,null,null,null,null,null,null,null,null,null,null,null,null,null,null,null,null,null,null,null,null,null,null,"Critical Headway (sec) = 4.3",null,null,null,null,null,null,null,null,null,null,null,null,null,null,null,null,null,null,"Braking distance upgrade 4% (ft)",null,77.354260089686107,105.28774289985054,105.28774289985054,137.51868460388641,174.04708520179375,214.87294469357255]
["LEFT-TURN LANE LENGTH (Feet) = QUEUE STORAGE + DECELERATION",null,null,null,null,null,null,null,null,null,null,null,null,null,null,null,null,null,null,null,null,null,null,null,null,"Left-Turning Vehicles (in vph)","TRR 1500 - Lengths of Left-Turn Lanes at Unsignalized Intersections*",null,null,null,null,null,null,null,null,null,null,null,null,null,null,null,null,null,"Braking distance upgrade 5% (ft)",null,75.409836065573785,102.64116575591987,102.64116575591987,134.06193078324227,169.67213114754099,209.47176684881606]
[null,null,null,null,null,null,null,null,null,null,null,null,null,null,null,null,null,null,null,null,null,null,null,null,null,null,"Opposing Volume (in vph)",null,null,null,null,null,null,null,null,null,null,null,null,null,null,null,null,null,"Braking distance upgrade 6% (ft)","Braking distance upgrade 3% (ft)",73.560767590618354,100.12437810945276,100.12437810945276,130.77469793887707,165.51172707889128,204.33546552949542]
[null,null,null,null,null,null,null,null,null,null,null,null,null,null,null,null,null,null,null,null,null,null,null,null,null,null,100,200,300,400,500,600,700,800,900,1000,1100,1200,null,null,null,null,null,null,"Braking distance upgrade 7% (ft)","Braking distance upgrade 3% (ft)",71.800208116545278,97.728061047519958,97.728061047519958,127.64481442941383,161.55046826222687,199.44502254595909,null,null,null,null,null,null,null,null,null,null,null,"Traffic Pattern Group",null,null,null,"10-Year"]
["Input Data",null,null,null,null,null,null,null,null,null,null,null,null,null,null,null,null,null,null,null,null,null,null,null,null,50,1,1,1,2,2,2,2,2,2,3,3,3,null,null,null,null,null,null,"Braking distance upgrade 8% (ft)","Braking distance upgrade 3% (ft)",70.121951219512198,95.44376693766938,95.44376693766938,124.66124661246614,157.77439024390245,194.78319783197833,null,null,null,null,null,null,null,null,null,null,"AADT",null,"K-Factor","D-Factor","Growth","Opposing"]
["Queue Storage",null,"Left-turning vehicles in vph",null,null,null,null,null,null,null,null,null,null,null,null,null,null,null,null,null,null,null,null,null,null,100,1,2,2,2,2,3,3,3,3,4,4,4,null,null,null,null,null,null,"Braking distance upgrade 9% (ft)","Braking distance upgrade 3% (ft)",68.520357497517381,93.263819927176442,93.263819927176442,121.81396888447534,154.1708043694141,190.33432638199272,null,null,null,null,null,null,null,null,null,null,null,null,null,null,"Factor","Volume"]
[null,null,"Critical Headway given by %HV and Number of Lanes in each direction",null,null,null,null,null,null,null,null,null,null,null,null,null,null,null,null,null,null,null,null,null,null,150,1,2,2,3,3,3,3,4,4,4,5,5,null,null,null,null,null,null,null,null,null,null,null,null,null,null,null,null,null,null,null,null,null,null,null,null,10000,1,9.9,55.6,1.1599999999999999,{"$f":"(BM21/100)*(BN21/100)*BO21*$BK$21","v":638.51040000000012}]
[null,null,"Percentage of Heavy Veh. making the left-turn: 5, 10, 20, 30, 40, 50, and 70",null,null,null,null,null,null,null,null,null,null,null,null,null,null,null,null,null,null,null,null,null,null,200,2,2,3,3,3,4,4,4,5,5,6,7,null,null,null,null,null,null,50,{"$f":"((AS22*AS22)/11.2)*1.075","v":239.95535714285714},null,null,null,null,null,null,null,null,null,null,null,null,null,null,null,null,null,2,10.24,58.38,1.1599999999999999,{"$f":"(BM22/100)*(BN22/100)*BO22*$BK$21","v":693.46099199999992}]
[null,null,"Number of lanes in each direction (major road): 2-lane or 4-lane ",null,null,null,null,null,null,null,null,null,null,null,null,null,null,null,null,null,null,null,null,null,null,250,2,2,3,3,4,4,5,5,6,6,7,8,null,null,null,null,null,null,3,null,{"$f":"((AS$22*AS$22)/(30*((11.2/32.2)-(AS23/100))))","v":262.19790241678072},null,null,null,null,null,null,null,null,null,null,null,null,null,null,null,null,3,10,57.95,1.1599999999999999,672.22]
[null,null,"Projected 10-Year Opposing Volume in vph = AADT * K * D * Growth Factor",null,null,null,null,null,null,null,null,null,null,null,null,null,null,null,null,null,null,null,null,null,null,300,2,2,3,4,4,5,5,6,6,8,9,11,null,null,null,null,null,null,4,null,{"$f":"((AS$22*AS$22)/(30*((11.2/32.2)-(AS24/100))))","v":270.71563088512244},null,null,null,null,null,null,null,null,null,null,null,null,null,null,null,null,4,10.4,52.55,1.1599999999999999,633.96319999999992]
[null,null,null,"AADT ",null,null,null,null,null,null,null,null,null,null,null,null,null,null,null,null,null,null,null,null,null,350,2,2,3,4,4,5,6,7,8,9,11,13,null,null,null,null,null,null,5,null,279.8053527980536,null,null,null,null,null,null,null,null,null,null,null,null,null,null,null,null,5,12.14,60.69,1.1599999999999999,854.66085600000008]
[null,null,null,"TPG provided K and D factors",null,null,null,null,null,null,null,null,null,null,null,null,null,null,null,null,null,null,null,null,null,400,2,3,4,4,5,6,6,7,9,11,13,17,null,null,null,null,null,null,6,null,289.52668680765368,null,null,null,null,null,null,null,null,null,null,null,null,null,null,null,null,6,14.5,62.62,1.1599999999999999,1053.2683999999997]
[null,null,null,"10-Year Growth Factor = 1.16  (Assuming a 1.5% annual growth) ",null,null,null,null,null,null,null,null,null,null,null,null,null,null,null,null,null,null,null,null,null,null,null,null,null,null,null,null,null,null,null,null,null,null,null,null,null,null,null,null,7,null,299.94783515910279,null,null,null,null,null,null,null,null,null,null,null,null,null,null,null,null,7,16.079999999999998,69.930000000000007,1.1599999999999999,1304.3903039999996]
["Deceleration",null,"Posted Speed in mph",null,null,null,null,null,null,null,null,null,null,null,null,null,null,null,null,null,null,null,null,null,null,"Critical Headway (sec) = 4.4",null,null,null,null,null,null,null,null,null,null,null,null,null,null,null,null,null,null,8,null,311.14718614718623,null,null,null,null,null,null,null,null,null,null,null,null,null,null,null,null,8,16.03,56.54,1.1599999999999999,1051.3499919999999]
[null,null,"Grade: from level (0%) to 9% upgrade or downgrade",null,null,null,null,null,null,null,null,null,null,null,null,null,null,null,null,null,null,null,null,null,null,"Left-Turning Vehicles (in vph)","TRR 1500 - Lengths of Left-Turn Lanes at Unsignalized Intersections*",null,null,null,null,null,null,null,null,null,null,null,null,null,null,null,null,null,9,null,323.2152894884768]
[null,null,null,null,null,null,null,null,null,null,null,null,null,null,null,null,null,null,null,null,null,null,null,null,null,null,"Opposing Volume (in vph)",null,null,null,null,null,null,null,null,null,null,null,null,null,null,null,null,null,0,null,239.58333333333337]
[null,null,null,null,null,null,null,null,null,null,null,null,null,null,null,null,null,null,null,null,null,null,null,null,null,null,100,200,300,400,500,600,700,800,900,1000,1100,1200,null,null,null,null,null,null,-3,null,220.56003068661303]
[null,null,null,null,null,null,null,null,null,null,null,null,null,null,null,null,null,null,null,null,null,null,null,null,null,50,1,1,2,2,2,2,2,2,2,3,3,3,null,null,null,null,null,null,-4,null,214.87294469357255]
["Critical Headway (sec) = 4.2",null,null,null,null,null,null,null,null,null,null,null,null,null,null,null,null,null,null,null,null,null,null,null,null,100,1,2,2,2,2,3,3,3,3,4,4,4,null,null,null,null,null,null,-5,null,209.47176684881606]
["Left-Turning Vehicles (in vph)",null,"TRR 1500 - Lengths of Left-Turn Lanes at Unsignalized Intersections*",null,null,null,null,null,null,null,null,null,null,null,null,null,null,null,null,null,null,null,null,null,null,150,1,2,2,3,3,3,4,4,4,5,5,6,null,null,null,null,null,null,-6,null,204.33546552949542]
[null,null,"Opposing Volume (in vph)",null,null,null,null,null,null,null,null,null,null,null,null,null,null,null,null,null,null,null,null,null,null,200,2,2,3,3,3,4,4,4,5,6,6,7,null,null,null,null,null,null,-7,null,199.44502254595909]
[null,0,100,200,300,400,500,600,700,800,900,1000,1100,1200,{"$f":"IF(C$2=4.2,INDEX(A36:N45,MATCH(C$4,A36:A45,),MATCH(C$5,A36:N36,)),)","v":0},null,null,null,null,null,null,null,null,null,null,250,2,2,3,3,4,4,5,5,6,7,8,9,null,null,null,null,null,null,-8,null,194.78319783197833]
[0,{"$f":"C37","v":15},{"$f":"C38","v":15},{"$f":"D38","v":15},15,40,40,40,40,40,40,65,65,65,null,"Modifiws LL SETS TO INCLUDE 0 -50 IN RANGE 9/15"]
[50,{"$f":"C38","v":15},{"$f":"(ROUND(AA6, 0)*25)-10","v":15},15,15,40,40,40,40,40,40,65,65,65,null,null,null,null,null,null,null,null,null,null,null,300,2,2,3,4,4,5,5,6,7,8,10,11,null,null,null,null,null,null,-9,null,190.33432638199272]
[100,15,15,15,40,40,40,65,65,65,65,65,90,90,null,null,null,null,null,null,null,null,null,null,null,350,2,3,3,4,4,5,6,7,8,10,12,15]
[150,15,15,40,40,40,65,65,65,90,90,90,115,115,null,null,null,null,null,null,null,null,null,null,null,400,2,3,4,4,5,6,7,8,9,12,15,19]
[200,15,15,40,40,65,65,90,90,90,115,115,140,140]
[250,40,40,40,65,65,90,90,90,115,115,140,165,190,null,null,null,null,null,null,null,null,null,null,null,"Critical Headway (sec) = 4.5",null,null,null,null,null,null,null,null,null,null,null,null,null,null,null,null,null,null,null,null,"Posted Speed (mph)"]
[300,40,40,40,65,65,90,90,115,140,140,165,190,240,null,null,null,null,null,null,null,null,null,null,null,"Left-Turning Vehicles (in vph)","TRR 1500 - Lengths of Left-Turn Lanes at Unsignalized Intersections*",null,null,null,null,null,null,null,null,null,null,null,null,null,null,null,null,null,null,null,null,"DECELERATION  (Feet)*"]
[350,40,40,40,65,90,90,115,140,140,165,190,240,290,null,null,null,null,null,null,null,null,null,null,null,null,"Opposing Volume (in vph)",null,null,null,null,null,null,null,null,null,null,null,null,null,null,null,null,null,null,null,null,"D 3%","D 4%","D 5%","D 6%","D 7%","D 8%","D 9%","Level ","U 3%","U 4%","U 5%","U 6%","U 7%","U 8%","U 9%"]
[400,40,40,65,65,90,115,115,140,165,190,240,290,365,null,null,null,null,null,null,null,null,null,null,null,null,100,200,300,400,500,600,700,800,900,1000,1100,1200,null,null,null,null,null,null,null,null,25,{"$f":"ROUNDUP($AU$5+$AU6,0)","v":139},{"$f":"ROUNDUP($AU$5+$AU7,0)","v":142},{"$f":"ROUNDUP($AU$5+$AU8,0)","v":145},{"$f":"ROUNDUP($AU$5+$AU9,0)","v":149},{"$f":"ROUNDUP($AU$5+$AU10,0)","v":153},{"$f":"ROUNDUP($AU$5+$AU11,0)","v":157},{"$f":"ROUNDUP($AU$5+$AU12,0)","v":161},{"$f":"ROUNDUP($AU$5+$AU13,0)","v":131},{"$f":"ROUNDUP($AU$5+$AU14,0)","v":124},{"$f":"ROUNDUP($AU$5+$AU15,0)","v":122},{"$f":"ROUNDUP($AU$5+$AU16,0)","v":120},{"$f":"ROUNDUP($AU$5+$AU17,0)","v":118},{"$f":"ROUNDUP($AU$5+$AU18,0)","v":116},{"$f":"ROUNDUP($AU$5+$AU19,0)","v":115},{"$f":"ROUNDUP($AU$5+$AU20,0)","v":113}]
[null,null,null,null,null,null,null,null,null,null,null,null,null,null,null,null,null,null,null,null,null,null,null,null,null,50,1,1,2,2,2,2,2,2,3,3,3,3,null,null,null,null,null,null,null,null,35,{"$f":"ROUNDUP($AV$5+$AV6,0)","v":188},{"$f":"ROUNDUP($AV$5+$AV7,0)","v":192},{"$f":"ROUNDUP($AV$5+$AV8,0)","v":196},{"$f":"ROUNDUP($AV$5+$AV9,0)","v":201},{"$f":"ROUNDUP($AV$5+$AV10,0)","v":206},{"$f":"ROUNDUP($AV$5+$AV11,0)","v":212},{"$f":"ROUNDUP($AV$5+$AV12,0)","v":218},{"$f":"ROUNDUP($AV$5+$AV13,0)","v":177},{"$f":"ROUNDUP($AV$5+$AV14,0)","v":167},{"$f":"ROUNDUP($AV$5+$AV15,0)","v":165},{"$f":"ROUNDUP($AV$5+$AV16,0)","v":162},{"$f":"ROUNDUP($AV$5+$AV17,0)","v":159},{"$f":"ROUNDUP($AV$5+$AV18,0)","v":157},{"$f":"ROUNDUP($AV$5+$AV19,0)","v":155},{"$f":"ROUNDUP($AV$5+$AV20,0)","v":153}]
["Critical Headway (sec) = 4.3",null,null,null,null,null,null,null,null,null,null,null,null,null,null,null,null,null,null,null,null,null,null,null,null,100,1,2,2,2,2,3,3,3,3,4,4,4,null,null,null,null,null,null,null,null,40,{"$f":"ROUNDUP($AW$5+$AW6,0)","v":188},{"$f":"ROUNDUP($AW$5+$AW7,0)","v":192},{"$f":"ROUNDUP($AW$5+$AW8,0)","v":196},{"$f":"ROUNDUP($AW$5+$AW9,0)","v":201},{"$f":"ROUNDUP($AW$5+$AW10,0)","v":206},{"$f":"ROUNDUP($AW$5+$AW11,0)","v":212},{"$f":"ROUNDUP($AW$5+$AW12,0)","v":218},{"$f":"ROUNDUP($AW$5+$AW13,0)","v":177},{"$f":"ROUNDUP($AW$5+$AW14,0)","v":167},{"$f":"ROUNDUP($AW$5+$AW15,0)","v":165},{"$f":"ROUNDUP($AW$5+$AW16,0)","v":162},{"$f":"ROUNDUP($AW$5+$AW17,0)","v":159},{"$f":"ROUNDUP($AW$5+$AW18,0)","v":157},{"$f":"ROUNDUP($AW$5+$AW19,0)","v":155},{"$f":"ROUNDUP($AW$5+$AW20,0)","v":153}]
["Left-Turning Vehicles (in vph)",null,"TRR 1500 - Lengths of Left-Turn Lanes at Unsignalized Intersections*",null,null,null,null,null,null,null,null,null,null,null,null,null,null,null,null,null,null,null,null,null,null,150,1,2,2,3,3,3,4,4,4,5,5,6,null,null,null,null,null,null,null,null,45,{"$f":"ROUNDUP($AX$5+$AX6,0)","v":234},{"$f":"ROUNDUP($AX$5+$AX7,0)","v":240},{"$f":"ROUNDUP($AX$5+$AX8,0)","v":246},{"$f":"ROUNDUP($AX$5+$AX9,0)","v":252},{"$f":"ROUNDUP($AX$5+$AX10,0)","v":259},{"$f":"ROUNDUP($AX$5+$AX11,0)","v":266},{"$f":"ROUNDUP($AX$5+$AX12,0)","v":274},{"$f":"ROUNDUP($AX$5+$AX13,0)","v":220},{"$f":"ROUNDUP($AX$5+$AX14,0)","v":208},{"$f":"ROUNDUP($AX$5+$AX15,0)","v":204},{"$f":"ROUNDUP($AX$5+$AX16,0)","v":201},{"$f":"ROUNDUP($AX$5+$AX17,0)","v":197},{"$f":"ROUNDUP($AX$5+$AX18,0)","v":194},{"$f":"ROUNDUP($AX$5+$AX19,0)","v":191},{"$f":"ROUNDUP($AX$5+$AX20,0)","v":188}]
[null,null,"Opposing Volume (in vph)",null,null,null,null,null,null,null,null,null,null,null,null,null,null,null,null,null,null,null,null,null,null,200,2,2,3,3,3,4,4,5,5,6,7,8,null,null,null,null,null,null,null,null,50,{"$f":"ROUNDUP($AY$5+$AY6,0)","v":286},{"$f":"ROUNDUP($AY$5+$AY7,0)","v":293},{"$f":"ROUNDUP($AY$5+$AY8,0)","v":301},{"$f":"ROUNDUP($AY$5+$AY9,0)","v":309},{"$f":"ROUNDUP($AY$5+$AY10,0)","v":317},{"$f":"ROUNDUP($AY$5+$AY11,0)","v":326},{"$f":"ROUNDUP($AY$5+$AY12,0)","v":336},{"$f":"ROUNDUP($AY$5+$AY13,0)","v":268},{"$f":"ROUNDUP($AY$5+$AY14,0)","v":253},{"$f":"ROUNDUP($AY$5+$AY15,0)","v":248},{"$f":"ROUNDUP($AY$5+$AY16,0)","v":244},{"$f":"ROUNDUP($AY$5+$AY17,0)","v":240},{"$f":"ROUNDUP($AY$5+$AY18,0)","v":236},{"$f":"ROUNDUP($AY$5+$AY19,0)","v":232},{"$f":"ROUNDUP($AY$5+$AY20,0)","v":228}]
[null,0,100,200,300,400,500,600,700,800,900,1000,1100,1200,{"$f":"IF(C$2=4.3,INDEX(A50:N59,MATCH(C$4,A50:A59,),MATCH(C$5,A50:N50,)),)","v":0},null,null,null,null,null,null,null,null,null,null,250,2,2,3,3,4,4,5,5,6,7,8,10,null,null,null,null,null,null,null,null,55,{"$f":"ROUNDUP($AZ$5+$AZ6,0)","v":344},{"$f":"ROUNDUP($AZ$5+$AZ7,0)","v":352},{"$f":"ROUNDUP($AZ$5+$AZ8,0)","v":361},{"$f":"ROUNDUP($AZ$5+$AZ9,0)","v":371},{"$f":"ROUNDUP($AZ$5+$AZ10,0)","v":381},{"$f":"ROUNDUP($AZ$5+$AZ11,0)","v":392},{"$f":"ROUNDUP($AZ$5+$AZ12,0)","v":405},{"$f":"ROUNDUP($AZ$5+$AZ13,0)","v":321},{"$f":"ROUNDUP($AZ$5+$AZ14,0)","v":302},{"$f":"ROUNDUP($AZ$5+$AZ15,0)","v":296},{"$f":"ROUNDUP($AZ$5+$AZ16,0)","v":291},{"$f":"ROUNDUP($AZ$5+$AZ17,0)","v":286},{"$f":"ROUNDUP($AZ$5+$AZ18,0)","v":281},{"$f":"ROUNDUP($AZ$5+$AZ19,0)","v":276},{"$f":"ROUNDUP($AZ$5+$AZ20,0)","v":272}]
[0,{"$f":"C51","v":15},{"$f":"C52","v":15},15,15,40,40,40,40,40,40,65,65,65]
[50,15,{"$f":"(ROUND(AA19, 0)*25)-10","v":15},15,15,40,40,40,40,40,40,65,65,65,null,null,null,null,null,null,null,null,null,null,null,300,2,2,3,4,4,5,5,6,7,9,10,12]
[100,15,15,40,40,40,40,65,65,65,65,90,90,90,null,null,null,null,null,null,null,null,null,null,null,350,2,3,3,4,5,5,6,7,8,10,13,16]
[150,15,15,40,40,65,65,65,65,90,90,90,115,115,null,null,null,null,null,null,null,null,null,null,null,400,2,3,4,4,5,6,7,8,10,13,16,22]
[200,40,40,40,65,65,65,90,90,90,115,115,140,165]
[250,40,40,40,65,65,90,90,115,115,140,140,165,190,null,null,null,null,null,null,null,null,null,null,null,"Critical Headway (sec) = 4.6"]
[300,40,40,40,65,90,90,115,115,140,140,190,215,265,null,null,null,null,null,null,null,null,null,null,null,"Left-Turning Vehicles (in vph)","TRR 1500 - Lengths of Left-Turn Lanes at Unsignalized Intersections*"]
[350,40,40,40,65,90,90,115,140,165,190,215,265,315,null,null,null,null,null,null,null,null,null,null,null,null,"Opposing Volume (in vph)"]
[400,40,40,65,90,90,115,140,140,165,215,265,315,415,null,null,null,null,null,null,null,null,null,null,null,null,100,200,300,400,500,600,700,800,900,1000,1100,1200]
[null,null,null,null,null,null,null,null,null,null,null,null,null,null,null,null,null,null,null,null,null,null,null,null,null,50,1,1,2,2,2,2,2,2,3,3,3,3]
["Critical Headway (sec) = 4.4",null,null,null,null,null,null,null,null,null,null,null,null,null,null,null,null,null,null,null,null,null,null,null,null,100,1,2,2,2,3,3,3,3,4,4,4,5]
["Left-Turning Vehicles (in vph)",null,"TRR 1500 - Lengths of Left-Turn Lanes at Unsignalized Intersections*",null,null,null,null,null,null,null,null,null,null,null,null,null,null,null,null,null,null,null,null,null,null,150,1,2,2,3,3,3,4,4,4,5,6,6]
[null,null,"Opposing Volume (in vph)",null,null,null,null,null,null,null,null,null,null,null,null,null,null,null,null,null,null,null,null,null,null,200,2,2,3,3,3,4,4,5,5,6,7,8]
[null,0,100,200,300,400,500,600,700,800,900,1000,1100,1200,{"$f":"IF(C$2=4.4,INDEX(A64:N73,MATCH(C$4,A64:A73,),MATCH(C$5,A64:N64,)),)","v":0},null,null,null,null,null,null,null,null,null,null,250,2,2,3,3,4,4,5,6,6,7,9,10]
[0,{"$f":"C65","v":15},{"$f":"C66","v":15},15,40,40,40,40,40,40,40,65,65,65]
[50,15,{"$f":"(ROUND(AA32, 0)*25)-10","v":15},15,40,40,40,40,40,40,40,65,65,65,null,null,null,null,null,null,null,null,null,null,null,300,2,2,3,4,4,5,6,6,8,9,11,14]
[100,15,15,40,40,40,40,65,65,65,65,90,90,90,null,null,null,null,null,null,null,null,null,null,null,350,2,3,4,4,5,6,6,8,9,11,14,19]
[150,15,15,40,40,65,65,65,90,90,90,115,115,140,null,null,null,null,null,null,null,null,null,null,null,400,2,3,4,5,5,6,7,9,11,14,18,26]
[200,40,40,40,65,65,65,90,90,90,115,140,140,165]
[250,40,40,40,65,65,90,90,115,115,140,165,190,215,null,null,null,null,null,null,null,null,null,null,null,"Critical Headway (sec) = 4.7"]
[300,40,{"$f":"(ROUND(AA38, 0)*25)-10","v":40},40,65,90,90,115,115,140,165,190,240,265,null,null,null,null,null,null,null,null,null,null,null,"Left-Turning Vehicles (in vph)","TRR 1500 - Lengths of Left-Turn Lanes at Unsignalized Intersections*"]
[350,40,40,65,65,90,90,115,140,165,190,240,290,365,null,null,null,null,null,null,null,null,null,null,null,null,"Opposing Volume (in vph)"]
[400,40,40,65,90,90,115,140,165,190,215,290,365,465,null,null,null,null,null,null,null,null,null,null,null,null,100,200,300,400,500,600,700,800,900,1000,1100,1200]
[null,null,null,null,null,null,null,null,null,null,null,null,null,null,null,null,null,null,null,null,null,null,null,null,null,50,1,1,2,2,2,2,2,2,3,3,3,3]
["Critical Headway (sec) = 4.5",null,null,null,null,null,null,null,null,null,null,null,null,null,null,null,null,null,null,null,null,null,null,null,null,100,1,2,2,2,3,3,3,3,4,4,4,5]
["Left-Turning Vehicles (in vph)",null,"TRR 1500 - Lengths of Left-Turn Lanes at Unsignalized Intersections*",null,null,null,null,null,null,null,null,null,null,null,null,null,null,null,null,null,null,null,null,null,null,150,1,2,2,3,3,3,4,4,5,5,6,6]
[null,null,"Opposing Volume (in vph)",null,null,null,null,null,null,null,null,null,null,null,null,null,null,null,null,null,null,null,null,null,null,200,2,2,3,3,4,4,4,5,6,6,7,8]
[null,0,100,200,300,400,500,600,700,800,900,1000,1100,1200,{"$f":"IF(C$2=4.5,INDEX(A78:N87,MATCH(C$4,A78:A87,),MATCH(C$5,A78:N78,)),)","v":0},null,null,null,null,null,null,null,null,null,null,250,2,2,3,4,4,5,5,6,7,8,9,11]
[0,{"$f":"C79","v":15},{"$f":"C80","v":15},15,40,40,40,40,40,40,65,65,65,65]
[50,15,{"$f":"(ROUND(AA46, 0)*25)-10","v":15},15,40,40,40,40,40,40,65,65,65,65,null,null,null,null,null,null,null,null,null,null,null,300,2,3,3,4,4,5,6,7,8,10,12,15]
[100,15,15,40,40,40,40,65,65,65,65,90,90,90,null,null,null,null,null,null,null,null,null,null,null,350,2,3,4,4,5,6,7,8,9,12,16,21]
[150,15,15,40,40,65,65,65,90,90,90,115,115,140,null,null,null,null,null,null,null,null,null,null,null,400,2,3,4,5,5,7,8,9,11,15,21,33]
[200,40,40,40,65,65,65,90,90,115,115,140,165,190]
[250,40,40,40,65,65,90,90,115,115,140,165,190,240,null,null,null,null,null,null,null,null,null,null,null,"Critical Headway (sec) = 4.8"]
[300,40,{"$f":"(ROUND(AA52, 0)*25)-10","v":40},40,65,90,90,115,115,140,165,215,240,290,null,null,null,null,null,null,null,null,null,null,null,"Left-Turning Vehicles (in vph)","TRR 1500 - Lengths of Left-Turn Lanes at Unsignalized Intersections*"]
[350,40,40,65,65,90,115,115,140,165,190,240,315,390,null,null,null,null,null,null,null,null,null,null,null,null,"Opposing Volume (in vph)"]
[400,40,40,65,90,90,115,140,165,190,240,315,390,540,null,null,null,null,null,null,null,null,null,null,null,null,100,200,300,400,500,600,700,800,900,1000,1100,1200]
[null,null,null,null,null,null,null,null,null,null,null,null,null,null,null,null,null,null,null,null,null,null,null,null,null,50,1,1,2,2,2,2,2,3,3,3,3,3]
["Critical Headway (sec) = 4.6",null,null,null,null,null,null,null,null,null,null,null,null,null,null,null,null,null,null,null,null,null,null,null,null,100,1,2,2,2,3,3,3,3,4,4,5,5]
["Left-Turning Vehicles (in vph)",null,"TRR 1500 - Lengths of Left-Turn Lanes at Unsignalized Intersections*",null,null,null,null,null,null,null,null,null,null,null,null,null,null,null,null,null,null,null,null,null,null,150,1,2,2,3,3,4,4,4,5,5,6,7]
[null,null,"Opposing Volume (in vph)",null,null,null,null,null,null,null,null,null,null,null,null,null,null,null,null,null,null,null,null,null,null,200,2,2,3,3,4,4,5,5,6,7,8,9]
[null,0,100,200,300,400,500,600,700,800,900,1000,1100,1200,{"$f":"IF(C$2=4.6,INDEX(A92:N101,MATCH(C$4,A92:A101,),MATCH(C$5,A92:N92,)),)","v":0},null,null,null,null,null,null,null,null,null,null,250,2,2,3,4,4,5,5,6,7,8,10,12]
[0,{"$f":"C93","v":15},{"$f":"C94","v":15},15,40,40,40,40,40,40,65,65,65,65]
[50,15,{"$f":"(ROUND(AA60, 0)*25)-10","v":15},15,40,40,40,40,40,40,65,65,65,65,null,null,null,null,null,null,null,null,null,null,null,300,2,3,3,4,5,5,6,7,8,10,13,17]
[100,15,15,40,40,40,65,65,65,65,90,90,90,115,null,null,null,null,null,null,null,null,null,null,null,350,2,3,4,4,5,6,7,8,10,13,17,25]
[150,15,15,40,40,65,65,65,90,90,90,115,140,140,null,null,null,null,null,null,null,null,null,null,null,400,2,3,4,5,6,7,8,10,12,17,24,43]
[200,40,40,40,65,65,65,90,90,115,115,140,165,190]
[250,40,40,40,65,65,90,90,115,140,140,165,215,240,null,null,null,null,null,null,null,null,null,null,null,"Critical Headway (sec) = 4.9"]
[300,40,{"$f":"(ROUND(AA66, 0)*25)-10","v":40},40,65,90,90,115,140,140,190,215,265,340,null,null,null,null,null,null,null,null,null,null,null,"Left-Turning Vehicles (in vph)","TRR 1500 - Lengths of Left-Turn Lanes at Unsignalized Intersections*"]
[350,40,40,65,90,90,115,140,140,190,215,265,340,465,null,null,null,null,null,null,null,null,null,null,null,null,"Opposing Volume (in vph)"]
[400,40,40,65,90,115,115,140,165,215,265,340,440,640,null,null,null,null,null,null,null,null,null,null,null,null,100,200,300,400,500,600,700,800,900,1000,1100,1200]
[null,null,null,null,null,null,null,null,null,null,null,null,null,null,null,null,null,null,null,null,null,null,null,null,null,50,1,1,2,2,2,2,2,3,3,3,3,3]
["Critical Headway (sec) = 4.7",null,null,null,null,null,null,null,null,null,null,null,null,null,null,null,null,null,null,null,null,null,null,null,null,100,1,2,2,2,3,3,3,4,4,4,5,5]
["Left-Turning Vehicles (in vph)",null,"TRR 1500 - Lengths of Left-Turn Lanes at Unsignalized Intersections*",null,null,null,null,null,null,null,null,null,null,null,null,null,null,null,null,null,null,null,null,null,null,150,1,2,3,3,3,4,4,4,5,6,6,7]
[null,null,"Opposing Volume (in vph)",null,null,null,null,null,null,null,null,null,null,null,null,null,null,null,null,null,null,null,null,null,null,200,2,2,3,3,4,4,5,5,6,7,8,10]
[null,0,100,200,300,400,500,600,700,800,900,1000,1100,1200,{"$f":"IF(C$2=4.7,INDEX(A106:N115,MATCH(C$4,A106:A115,),MATCH(C$5,A106:N106,)),)","v":0},null,null,null,null,null,null,null,null,null,null,250,2,2,3,4,4,5,6,6,7,9,11,13]
[0,{"$f":"C107","v":15},{"$f":"C108","v":15},15,40,40,40,40,40,40,65,65,65,65]
[50,15,{"$f":"(ROUND(AA74, 0)*25)-10","v":15},15,40,40,40,40,40,40,65,65,65,65,null,null,null,null,null,null,null,null,null,null,null,300,2,3,3,4,5,6,6,7,9,11,14,19]
[100,15,15,40,40,40,65,65,65,65,90,90,90,115,null,null,null,null,null,null,null,null,null,null,null,350,2,3,4,5,5,6,7,9,11,14,20,30]
[150,15,15,40,40,65,65,65,90,90,115,115,140,140,null,null,null,null,null,null,null,null,null,null,null,400,2,3,4,5,6,7,9,10,13,19,29,64]
[200,40,40,40,65,65,90,90,90,115,140,140,165,190]
[250,40,40,40,65,90,90,115,115,140,165,190,215,265,null,null,null,null,null,null,null,null,null,null,null,"Critical Headway (sec) = 5.1"]
[300,40,{"$f":"(ROUND(AA80, 0)*25)-10","v":40},65,65,90,90,115,140,165,190,240,290,365,null,null,null,null,null,null,null,null,null,null,null,"Left-Turning Vehicles (in vph)","TRR 1500 - Lengths of Left-Turn Lanes at Unsignalized Intersections*"]
[350,40,40,65,90,90,115,140,165,190,215,290,390,515,null,null,null,null,null,null,null,null,null,null,null,null,"Opposing Volume (in vph)"]
[400,40,40,65,90,115,115,165,190,215,265,365,515,815,null,null,null,null,null,null,null,null,null,null,null,null,100,200,300,400,500,600,700,800,900,1000,1100,1200]
[null,null,null,null,null,null,null,null,null,null,null,null,null,null,null,null,null,null,null,null,null,null,null,null,null,50,1,1,2,2,2,2,2,3,3,3,3,4]
["Critical Headway (sec) = 4.8",null,null,null,null,null,null,null,null,null,null,null,null,null,null,null,null,null,null,null,null,null,null,null,null,100,1,2,2,3,3,3,3,4,4,5,5,6]
["Left-Turning Vehicles (in vph)",null,"TRR 1500 - Lengths of Left-Turn Lanes at Unsignalized Intersections*",null,null,null,null,null,null,null,null,null,null,null,null,null,null,null,null,null,null,null,null,null,null,150,2,2,3,3,3,4,4,5,5,6,7,8]
[null,null,"Opposing Volume (in vph)",null,null,null,null,null,null,null,null,null,null,null,null,null,null,null,null,null,null,null,null,null,null,200,2,2,3,3,4,4,5,6,6,8,9,11]
[null,0,100,200,300,400,500,600,700,800,900,1000,1100,1200,{"$f":"IF(C$2=4.8,INDEX(A120:N129,MATCH(C$4,A120:A129,),MATCH(C$5,A120:N120,)),)","v":0},null,null,null,null,null,null,null,null,null,null,250,2,2,3,4,4,5,6,7,8,10,13,16]
[0,{"$f":"C121","v":15},{"$f":"C122","v":15},15,40,40,40,40,40,65,65,65,65,65]
[50,15,{"$f":"(ROUND(AA88, 0)*25)-10","v":15},15,40,40,40,40,40,65,65,65,65,65,null,null,null,null,null,null,null,null,null,null,null,300,2,3,4,4,5,6,7,8,10,13,18,26]
[100,15,15,40,40,40,65,65,65,65,90,90,115,115,null,null,null,null,null,null,null,null,null,null,null,350,2,3,4,5,6,7,8,10,12,17,26,53]
[150,15,15,40,40,65,65,90,90,90,115,115,140,165,null,null,null,null,null,null,null,null,null,null,null,400,2,3,4,5,6,8,10,12,16,24,48,70]
[200,40,40,40,65,65,90,90,115,115,140,165,190,215]
[250,40,40,40,65,90,90,115,115,140,165,190,240,290,null,null,null,null,null,null,null,null,null,null,null,"Critical Headway (sec) = 5.5"]
[300,40,{"$f":"(ROUND(AA94, 0)*25)-10","v":40},65,65,90,115,115,140,165,190,240,315,415,null,null,null,null,null,null,null,null,null,null,null,"Left-Turning Vehicles (in vph)","TRR 1500 - Lengths of Left-Turn Lanes at Unsignalized Intersections*"]
[350,40,40,65,90,90,115,140,165,190,240,315,415,615,null,null,null,null,null,null,null,null,null,null,null,null,"Opposing Volume (in vph)"]
[400,40,40,65,90,115,140,165,190,240,290,415,590,1065,null,null,null,null,null,null,null,null,null,null,null,null,100,200,300,400,500,600,700,800,900,1000,1100,1200]
[null,null,null,null,null,null,null,null,null,null,null,null,null,null,null,null,null,null,null,null,null,null,null,null,null,50,1,1,2,2,2,2,3,3,3,3,4,4]
["Critical Headway (sec) = 4.9",null,null,null,null,null,null,null,null,null,null,null,null,null,null,null,null,null,null,null,null,null,null,null,null,100,1,2,2,3,3,3,4,4,5,5,6,6]
["Left-Turning Vehicles (in vph)",null,"TRR 1500 - Lengths of Left-Turn Lanes at Unsignalized Intersections*",null,null,null,null,null,null,null,null,null,null,null,null,null,null,null,null,null,null,null,null,null,null,150,2,2,3,3,4,4,5,5,6,7,8,10]
[null,null,"Opposing Volume (in vph)",null,null,null,null,null,null,null,null,null,null,null,null,null,null,null,null,null,null,null,null,null,null,200,2,2,3,4,4,5,6,7,8,10,12,15]
[null,0,100,200,300,400,500,600,700,800,900,1000,1100,1200,{"$f":"IF(C$2=4.9,INDEX(A134:N143,MATCH(C$4,A134:A143,),MATCH(C$5,A134:N134,)),)","v":0},null,null,null,null,null,null,null,null,null,null,250,2,3,4,4,5,6,7,8,10,13,18,27]
[0,{"$f":"C135","v":15},{"$f":"C136","v":15},15,40,40,40,40,40,65,65,65,65,65]
[50,15,{"$f":"(ROUND(AA102, 0)*25)-10","v":15},15,40,40,40,40,40,65,65,65,65,65,null,null,null,null,null,null,null,null,null,null,null,300,2,3,4,5,6,7,8,10,13,19,32,91]
[100,15,15,40,40,40,65,65,65,90,90,90,115,115,null,null,null,null,null,null,null,null,null,null,null,350,2,3,4,5,6,8,10,13,18,30,109,109]
[150,15,15,40,65,65,65,90,90,90,115,140,140,165,null,null,null,null,null,null,null,null,null,null,null,400,2,3,5,6,7,9,12,16,25,66,109,109]
[200,40,40,40,65,65,90,90,115,115,140,165,190,240]
[250,40,40,40,65,90,90,115,140,140,165,215,265,315]
[300,40,{"$f":"(ROUND(AA108, 0)*25)-10","v":40},65,65,90,115,140,140,165,215,265,340,465]
[350,40,40,65,90,115,115,140,165,215,265,340,490,740]
[400,40,40,65,90,115,140,165,215,240,315,465,715,1590]
[]
["Critical Headway (sec) = 5.1"]
["Left-Turning Vehicles (in vph)",null,"TRR 1500 - Lengths of Left-Turn Lanes at Unsignalized Intersections*"]
[null,null,"Opposing Volume (in vph)"]
[null,0,100,200,300,400,500,600,700,800,900,1000,1100,1200,{"$f":"IF(C$2=5.1,INDEX(A148:N157,MATCH(C$4,A148:A157,),MATCH(C$5,A148:N148,)),)","v":0}]
[0,{"$f":"C149","v":15},{"$f":"C150","v":15},15,40,40,40,40,40,65,65,65,65,90]
[50,15,{"$f":"(ROUND(AA116, 0)*25)-10","v":15},15,40,40,40,40,40,65,65,65,65,90]
[100,15,15,40,40,65,65,65,65,90,90,115,115,140]
[150,40,40,40,65,65,65,90,90,115,115,140,165,190]
[200,40,40,40,65,65,90,90,115,140,140,190,215,265]
[250,40,40,40,65,90,90,115,140,165,190,240,315,390]
[300,40,{"$f":"(ROUND(AA122, 0)*25)-10","v":40},65,90,90,115,140,165,190,240,315,440,640]
[350,40,40,65,90,115,140,165,190,240,290,415,640,1315]
[400,40,40,65,90,115,140,190,240,290,390,590,1190,1740]
[]
["Critical Headway (sec) = 5.5"]
["Left-Turning Vehicles (in vph)",null,"TRR 1500 - Lengths of Left-Turn Lanes at Unsignalized Intersections*"]
[null,null,"Opposing Volume (in vph)"]
[null,0,{"$f":"C163","v":15},{"$f":"D163","v":15},{"$f":"E163","v":40},{"$f":"F163","v":40},{"$f":"G163","v":40},{"$f":"H163","v":40},{"$f":"I163","v":65},{"$f":"J163","v":65},{"$f":"K163","v":65},{"$f":"L163","v":65},{"$f":"M163","v":90},{"$f":"N163","v":90},{"$f":"IF(C$2=5.5,INDEX(A162:N171,MATCH(C$4,A162:A171,),MATCH(C$5,A162:N162,)),)","v":0}]
[0,{"$f":"C163","v":15},15,15,40,40,40,40,65,65,65,65,90,90]
[50,15,{"$f":"(ROUND(AA130, 0)*25)-10","v":15},15,40,40,40,40,65,65,65,65,90,90]
[100,15,15,40,40,65,65,65,90,90,115,115,140,140]
[150,40,40,40,65,65,90,90,115,115,140,165,190,240]
[200,40,40,40,65,90,90,115,140,165,190,240,290,365]
[250,40,40,65,90,90,115,140,165,190,240,315,440,665]
[300,40,{"$f":"(ROUND(AA136, 0)*25)-10","v":40},65,90,115,140,165,190,240,315,465,790,2265]
[350,40,40,65,90,115,140,190,240,315,440,740,2715,2715]
[400,40,40,65,115,140,165,215,290,390,615,1640,2715,2715]

{"sheet":"R>50+Calcs","index":5,"n_rows":594,"n_cols":19,"rows_kept":594,"cut":false,"hidden":true,"merged":[[566,1,569,1],[566,2,569,2],[566,3,569,3],[566,4,567,9],[535,2,538,2],[504,3,507,3],[504,4,505,9],[442,2,445,2],[442,3,445,3],[442,4,443,9],[563,1,563,9],[501,1,501,9],[502,1,502,9],[503,1,503,9],[535,3,538,3],[535,4,536,9],[532,2,532,9],[533,2,533,9],[534,1,534,9],[504,1,507,1],[504,2,507,2],[473,1,476,1],[473,2,476,2],[473,3,476,3],[473,4,474,9],[470,1,470,9],[472,1,472,9],[441,1,441,9],[442,1,445,1],[565,1,565,9],[439,2,439,9],[440,2,440,9],[410,1,410,9],[411,1,414,1],[411,2,414,2],[411,3,414,3],[411,4,412,9],[408,1,408,9],[409,1,409,9],[379,1,379,9],[285,1,285,9],[286,1,286,9],[318,1,321,1],[318,2,321,2],[380,2,383,2],[380,3,383,3],[380,4,381,9],[287,1,290,1],[287,2,290,2],[287,3,290,3],[287,4,288,9],[347,1,347,9],[316,1,316,9],[317,1,317,9],[318,3,321,3],[318,4,319,9],[348,1,348,9],[349,1,352,1],[349,2,352,2],[349,3,352,3],[349,4,350,9],[255,1,255,9],[256,1,259,1],[256,2,259,2],[256,3,259,3],[256,4,257,9],[253,1,253,9],[254,1,254,9],[224,1,224,9],[225,1,228,1],[225,2,228,2],[225,3,228,3],[225,4,226,9],[222,2,222,9],[191,1,191,9],[192,1,192,9],[162,1,162,9],[163,1,166,1],[223,2,223,9],[193,1,193,9],[194,1,197,1],[194,2,197,2],[194,3,197,3],[194,4,195,9],[97,1,97,9],[98,1,98,9],[99,1,99,9],[100,1,103,1],[100,2,103,2],[100,3,103,3],[100,4,101,9],[163,2,166,2],[163,3,166,3],[163,4,164,9],[159,1,159,9],[160,1,160,9],[128,2,128,9],[129,2,129,9],[130,1,130,9],[131,1,134,1],[131,2,134,2],[131,3,134,3],[131,4,132,9],[6,1,6,9],[7,1,10,1],[7,2,10,2],[68,1,68,9],[69,1,72,1],[69,2,72,2],[69,3,72,3],[69,4,70,9],[37,1,37,9],[38,1,41,1],[38,2,41,2],[38,3,41,3],[38,4,39,9],[66,1,66,9],[67,1,67,9],[7,3,10,3],[7,4,8,9],[35,1,35,9],[36,1,36,9]]}
[null,"Projected ADT",{"$f":"IF('Aux Lane Inputs-Tab 2'!K11<2000,E1,IF('Aux Lane Inputs-Tab 2'!K11<4000,E2,IF('Aux Lane Inputs-Tab 2'!K11<10000,E3,IF('Aux Lane Inputs-Tab 2'!K11>10000,E4,0))))","v":"Less Than 2,000"},null,"Less Than 2,000",null,"IF(A6>0,A6,IF(B6>0,B6,IF(C6>0,C6),IF(C6>0,C6,IF(D6>0,D6,IF(E6>0,E6,IF(F6>0,F6,IF(G6>0,G6,IF(H6>0,H6,IF(I6>0,I6,IF(J6>0,J6,IF(K6>0,K6,IF(L6>0,L6,IF(M6>0,M6,IF(N6>0,N6,IF(O6>0,O6,IF(P6>0,P6,IF(Q6>0,Q6,IF(R6>0,R6))))))))))))))))))",null,"If Heavy veh >=10%"]
[null,"RT Turn ADT",{"$f":"'Aux Lane Inputs-Tab 2'!K14","v":"0-50"},null,"2,000 to 4,000 Vehicles",null,"RTL Length",{"$f":"SUM(A6:S6)+I2","v":{"$error":"#N/A"}},{"$f":"IF(AND('Aux Lane Inputs-Tab 2'!E17>=10,SUM(A6:S6)>0),25,0)","v":{"$error":"#N/A"}},null,null,{"$f":"IF(-3<='Aux Lane Inputs-Tab 2'!K16*100<=3,0,'Aux Lane Inputs-Tab 2'!K16*100)","v":0}]
[null,"Posted SL",{"$f":"'Aux Lane Inputs-Tab 2'!K6","v":0},null,"4,001 to 10,000 Vehicles",null,null,null,{"$f":"IF(#REF!=\"RCP\",INDEX($BL$69:$BZ$89,MATCH(#REF!,$BL$69:$BL$89,),MATCH(#REF!,$BL$69:$BZ$69,)),IF(#REF!=\"ERCP\",INDEX($CA$69:$CN$89,MATCH(#REF!,$CA$69:$CA$89,),MATCH(#REF!,$CA$69:$CN$69,)),INDEX($BL$97:$BX$116,MATCH(#REF!,$BL$97:$BL$115,),MATCH(#REF!,$BL$97:$BX$97,))))","v":{"$error":"#REF!"}},"Example of Indexing"]
[null,"Roadway Slope",{"$f":"IF(-3<='Aux Lane Inputs-Tab 2'!K16*100<=3,0,ROUNDDOWN('Aux Lane Inputs-Tab 2'!K16*100,0))","v":0},{"$f":"ROUNDUP(C4,0)","v":0},"Over 10,000 Vehicles",{"$f":"C1&C2","v":"Less Than 2,0000-50"}]
[-1,-2,-3,-4,-5,-6,-7,-8,-9,0,1,2,3,4,5,6,7,8,9]
[{"$f":"M10","v":0},{"$f":"M41","v":0},{"$f":"M72","v":0},{"$f":"M103","v":0},{"$f":"M134","v":0},{"$f":"M166","v":0},{"$f":"M197","v":0},{"$f":"M228","v":0},{"$f":"M259","v":0},{"$f":"M290","v":{"$error":"#N/A"}},{"$f":"M321","v":0},{"$f":"M352","v":0},{"$f":"M383","v":0},{"$f":"M414","v":0},{"$f":"M445","v":0},{"$f":"M476","v":0},{"$f":"M507","v":0},{"$f":"M538","v":0},{"$f":"M569","v":0}]
[null,"Right-Turn Lane Warrants (R > 50')  G = 1% Downgrade"]
[null,"Projected 10-Year     Roadway ADT","Right-turn ADT","Assumed Speed Change on Through Lane","Highway Posted Speed"]
[]
[null,null,null,null,null,null,null,null,null,null,null,null,{"$f":"IF(D$4=-1,INDEX(E11:L35,MATCH(F$4,E11:E35,),MATCH(C$3,E11:L11,)),)","v":0}]
[null,null,null,null,null,25,30,35,40,45,50,55]
[null,"Less Than 2,000","0-50",null,{"$f":"B12&C12","v":"Less Than 2,0000-50"},"-","-","-","-","-","-","-"]
[null,"Less Than 2,000","51 - 100",null,{"$f":"B13&C13","v":"Less Than 2,00051 - 100"},"-","-","-","-","-","-","-"]
[null,"Less Than 2,000","101 - 200","20 MPH","Less Than 2,000101 - 200","-",100,100,135,135,150,195]
[null,"Less Than 2,000","201 - 300",null,"Less Than 2,000201 - 300","-",100,100,135,150,195,240]
[null,"Less Than 2,000","301 - 400",null,"Less Than 2,000301 - 400","-",100,100,135,150,195,240]
[null,"Less Than 2,000","Over 400","15 MPH","Less Than 2,000Over 400","-",100,100,135,150,195,240]
[null,"2,000 to 4,000 Vehicles","0-50",null,{"$f":"B18&C18","v":"2,000 to 4,000 Vehicles0-50"},"-","-","-","-","-","-","-"]
[null,"2,000 to 4,000 Vehicles","51 - 100",null,"2,000 to 4,000 Vehicles51 - 100","-","-","-","-","-","-","-"]
[null,"2,000 to 4,000 Vehicles","101 - 200","20 MPH","2,000 to 4,000 Vehicles101 - 200","-",100,100,135,135,150,195]
[null,"2,000 to 4,000 Vehicles","201 - 300","20 MPH","2,000 to 4,000 Vehicles201 - 300","-",100,100,135,150,195,240]
[null,"2,000 to 4,000 Vehicles","301 - 400","15 MPH","2,000 to 4,000 Vehicles301 - 400","-",100,100,135,150,195,240]
[null,"2,000 to 4,000 Vehicles","Over 400","10 MPH","2,000 to 4,000 VehiclesOver 400",100,110,110,150,195,240,295]
[null,"4,001 to 10,000 Vehicles","0-50",null,{"$f":"B24&C24","v":"4,001 to 10,000 Vehicles0-50"},"-","-","-","-","-","-","-"]
[null,"4,001 to 10,000 Vehicles","51 - 100","20 MPH","4,001 to 10,000 Vehicles51 - 100","-",135,135,135,135,150,195]
[null,"4,001 to 10,000 Vehicles","101 - 200","15 MPH","4,001 to 10,000 Vehicles101 - 200","-",135,135,135,150,195,240]
[null,"4,001 to 10,000 Vehicles","201 - 300",null,"4,001 to 10,000 Vehicles201 - 300",135,135,135,150,195,240,295]
[null,"4,001 to 10,000 Vehicles","301 - 400","10 MPH","4,001 to 10,000 Vehicles301 - 400",135,135,135,150,195,240,295]
[null,"4,001 to 10,000 Vehicles","Over 400","5 MPH","4,001 to 10,000 VehiclesOver 400",135,150,150,195,240,295,355]
[null,"Over 10,000 Vehicles","0-50",null,{"$f":"B30&C30","v":"Over 10,000 Vehicles0-50"},"-","-","-","-","-","-","-"]
[null,"Over 10,000 Vehicles","51 - 100","15 MPH","Over 10,000 Vehicles51 - 100","-",135,135,135,150,195,240]
[null,"Over 10,000 Vehicles","101 - 200","10 MPH","Over 10,000 Vehicles101 - 200",135,135,135,150,195,240,295]
[null,"Over 10,000 Vehicles","201 - 300","5 MPH","Over 10,000 Vehicles201 - 300",135,150,150,195,240,295,355]
[null,"Over 10,000 Vehicles","301 - 400",null,"Over 10,000 Vehicles301 - 400",135,150,150,195,240,295,355]
[null,"Over 10,000 Vehicles","Over 400","0 MPH","Over 10,000 VehiclesOver 400",135,195,195,240,295,355,415]
[]
[]
[null,"Right-Turn Lane Warrants (R > 50')  G = 2% Downgrade"]
[null,"Projected 10-Year     Roadway ADT","Right-turn ADT","Assumed Speed Change on Through Lane","Highway Posted Speed"]
[]
[null,null,null,null,null,null,null,null,null,null,null,null,{"$f":"IF(D$4=-2,INDEX(E42:L66,MATCH(F$4,E42:E66,),MATCH(C$3,E42:L42,)),)","v":0}]
[null,null,null,null,null,25,30,35,40,45,50,55]
[null,"Less Than 2,000","0-50",null,{"$f":"B43&C43","v":"Less Than 2,0000-50"},"-","-","-","-","-","-","-"]
[null,"Less Than 2,000","51 - 100",null,{"$f":"B44&C44","v":"Less Than 2,00051 - 100"},"-","-","-","-","-","-","-"]
[null,"Less Than 2,000","101 - 200","20 MPH","Less Than 2,000101 - 200","-",100,100,135,135,150,195]
[null,"Less Than 2,000","201 - 300",null,"Less Than 2,000201 - 300","-",100,100,135,150,195,240]
[null,"Less Than 2,000","301 - 400",null,"Less Than 2,000301 - 400","-",100,100,135,150,195,240]
[null,"Less Than 2,000","Over 400","15 MPH","Less Than 2,000Over 400","-",100,100,135,150,195,240]
[null,"2,000 to 4,000 Vehicles","0-50",null,{"$f":"B49&C49","v":"2,000 to 4,000 Vehicles0-50"},"-","-","-","-","-","-","-"]
[null,"2,000 to 4,000 Vehicles","51 - 100",null,"2,000 to 4,000 Vehicles51 - 100","-","-","-","-","-","-","-"]
[null,"2,000 to 4,000 Vehicles","101 - 200","20 MPH","2,000 to 4,000 Vehicles101 - 200","-",100,100,135,135,150,195]
[null,"2,000 to 4,000 Vehicles","201 - 300",null,"2,000 to 4,000 Vehicles201 - 300","-",100,100,135,150,195,240]
[null,"2,000 to 4,000 Vehicles","301 - 400","15 MPH","2,000 to 4,000 Vehicles301 - 400","-",100,100,135,150,195,240]
[null,"2,000 to 4,000 Vehicles","Over 400","10 MPH","2,000 to 4,000 VehiclesOver 400",100,110,110,150,195,240,295]
[null,"4,001 to 10,000 Vehicles","0-50",null,{"$f":"B55&C55","v":"4,001 to 10,000 Vehicles0-50"},"-","-","-","-","-","-","-"]
[null,"4,001 to 10,000 Vehicles","51 - 100","20 MPH","4,001 to 10,000 Vehicles51 - 100","-",135,135,135,135,150,195]
[null,"4,001 to 10,000 Vehicles","101 - 200","15 MPH","4,001 to 10,000 Vehicles101 - 200","-",135,135,135,150,195,240]
[null,"4,001 to 10,000 Vehicles","201 - 300",null,"4,001 to 10,000 Vehicles201 - 300",135,135,135,150,195,240,295]
[null,"4,001 to 10,000 Vehicles","301 - 400","10 MPH","4,001 to 10,000 Vehicles301 - 400",135,135,135,150,195,240,295]
[null,"4,001 to 10,000 Vehicles","Over 400","5 MPH","4,001 to 10,000 VehiclesOver 400",135,150,150,195,240,295,355]
[null,"Over 10,000 Vehicles","0-50",null,{"$f":"B61&C61","v":"Over 10,000 Vehicles0-50"},"-","-","-","-","-","-","-"]
[null,"Over 10,000 Vehicles","51 - 100","15 MPH","Over 10,000 Vehicles51 - 100","-",135,135,135,150,195,240]
[null,"Over 10,000 Vehicles","101 - 200","10 MPH","Over 10,000 Vehicles101 - 200",135,135,135,150,195,240,295]
[null,"Over 10,000 Vehicles","201 - 300","5 MPH","Over 10,000 Vehicles201 - 300",135,150,150,195,240,295,355]
[null,"Over 10,000 Vehicles","301 - 400","5 MPH","Over 10,000 Vehicles301 - 400",135,150,150,195,240,295,355]
[null,"Over 10,000 Vehicles","Over 400","0 MPH","Over 10,000 VehiclesOver 400",135,195,195,240,295,355,415]
[]
[]
[null,"Right-Turn Lane Warrants (R > 50')  G = 3% Downgrade"]
[null,"Projected 10-Year     Roadway ADT","Right-turn ADT","Assumed Speed Change on Through Lane","Highway Posted Speed"]
[]
[null,null,null,null,null,null,null,null,null,null,null,null,{"$f":"IF(D$4=-3,INDEX(E73:L97,MATCH(F$4,E73:E97,),MATCH(C$3,E73:L73,)),)","v":0}]
[null,null,null,null,null,25,30,35,40,45,50,55]
[null,"Less Than 2,000","0-50",null,{"$f":"B74&C74","v":"Less Than 2,0000-50"},"-","-","-","-","-","-","-"]
[null,"Less Than 2,000","51 - 100",null,"Less Than 2,00051 - 100","-","-","-","-","-","-","-"]
[null,"Less Than 2,000","101 - 200","20 MPH","Less Than 2,000101 - 200","-",100,100,135,135,160,205]
[null,"Less Than 2,000","201 - 300","15 MPH","Less Than 2,000201 - 300","-",100,100,135,160,205,255]
[null,"Less Than 2,000","301 - 400",null,"Less Than 2,000301 - 400","-",100,100,135,160,205,255]
[null,"Less Than 2,000","Over 400",null,"Less Than 2,000Over 400","-",100,100,135,160,205,255]
[null,"2,000 to 4,000 Vehicles","0-50",null,{"$f":"B80&C80","v":"2,000 to 4,000 Vehicles0-50"},"-","-","-","-","-","-","-"]
[null,"2,000 to 4,000 Vehicles","51 - 100",null,{"$f":"B81&C81","v":"2,000 to 4,000 Vehicles51 - 100"},"-","-","-","-","-","-","-"]
[null,"2,000 to 4,000 Vehicles","101 - 200","20 MPH","2,000 to 4,000 Vehicles101 - 200","-",100,100,135,135,160,205]
[null,"2,000 to 4,000 Vehicles","201 - 300","20 MPH","2,000 to 4,000 Vehicles201 - 300","-",100,100,135,160,205,255]
[null,"2,000 to 4,000 Vehicles","301 - 400","15 MPH","2,000 to 4,000 Vehicles301 - 400","-",100,100,135,160,205,255]
[null,"2,000 to 4,000 Vehicles","Over 400","10 MPH","2,000 to 4,000 VehiclesOver 400",100,115,115,160,205,255,315]
[null,"4,001 to 10,000 Vehicles","0-50",null,{"$f":"B86&C86","v":"4,001 to 10,000 Vehicles0-50"},"-","-","-","-","-","-","-"]
[null,"4,001 to 10,000 Vehicles","51 - 100","20 MPH","4,001 to 10,000 Vehicles51 - 100","-",135,135,135,135,160,205]
[null,"4,001 to 10,000 Vehicles","101 - 200","15 MPH","4,001 to 10,000 Vehicles101 - 200","-",135,135,135,160,205,255]
[null,"4,001 to 10,000 Vehicles","201 - 300","10 MPH","4,001 to 10,000 Vehicles201 - 300",135,135,135,160,205,255,315]
[null,"4,001 to 10,000 Vehicles","301 - 400","10 MPH","4,001 to 10,000 Vehicles301 - 400",135,135,135,160,205,255,315]
[null,"4,001 to 10,000 Vehicles","Over 400","5 MPH","4,001 to 10,000 VehiclesOver 400",135,160,160,205,255,315,375]
[null,"Over 10,000 Vehicles","0-50",null,{"$f":"B92&C92","v":"Over 10,000 Vehicles0-50"},"-","-","-","-","-","-","-"]
[null,"Over 10,000 Vehicles","51 - 100","15 MPH","Over 10,000 Vehicles51 - 100","-",135,135,135,160,205,255]
[null,"Over 10,000 Vehicles","101 - 200","10 MPH","Over 10,000 Vehicles101 - 200",135,135,135,160,205,255,315]
[null,"Over 10,000 Vehicles","201 - 300","5 MPH","Over 10,000 Vehicles201 - 300",135,155,160,205,255,315,375]
[null,"Over 10,000 Vehicles","301 - 400","5 MPH","Over 10,000 Vehicles301 - 400",135,155,160,205,255,315,375]
[null,"Over 10,000 Vehicles","Over 400","0 MPH","Over 10,000 VehiclesOver 400",135,205,205,255,315,375,445]
[]
[]
[null,"Right-Turn Lane Warrants (R > 50')  G = 4% Downgrade"]
[null,"Projected 10-Year     Roadway ADT","Right-turn ADT","Assumed Speed Change on Through Lane","Highway Posted Speed"]
[]
[null,null,null,null,null,null,null,null,null,null,null,null,{"$f":"IF(D$4=-4,INDEX(E104:L128,MATCH(F$4,E104:E128,),MATCH(C$3,E104:L104,)),)","v":0}]
[null,null,null,null,null,25,30,35,40,45,50,55]
[null,"Less Than 2,000","0-50",null,{"$f":"B105&C105","v":"Less Than 2,0000-50"},"-","-","-","-","-","-","-"]
[null,"Less Than 2,000","51 - 100",null,{"$f":"B106&C106","v":"Less Than 2,00051 - 100"},"-","-","-","-","-","-","-"]
[null,"Less Than 2,000","101 - 200","20 MPH","Less Than 2,000101 - 200","-",100,100,135,135,160,210]
[null,"Less Than 2,000","201 - 300","15 MPH","Less Than 2,000201 - 300","-",100,100,135,160,210,265]
[null,"Less Than 2,000","301 - 400",null,"Less Than 2,000301 - 400","-",100,100,135,160,210,265]
[null,"Less Than 2,000","Over 400",null,"Less Than 2,000Over 400","-",100,100,135,160,210,265]
[null,"2,000 to 4,000 Vehicles","0-50",null,{"$f":"B111&C111","v":"2,000 to 4,000 Vehicles0-50"},"-","-","-","-","-","-","-"]
[null,"2,000 to 4,000 Vehicles","51 - 100",null,"2,000 to 4,000 Vehicles51 - 100","-","-","-","-","-","-","-"]
[null,"2,000 to 4,000 Vehicles","101 - 200","20 MPH","2,000 to 4,000 Vehicles101 - 200","-",100,100,135,135,160,210]
[null,"2,000 to 4,000 Vehicles","201 - 300",null,"2,000 to 4,000 Vehicles201 - 300","-",100,100,135,160,210,265]
[null,"2,000 to 4,000 Vehicles","301 - 400","15 MPH","2,000 to 4,000 Vehicles301 - 400","-",100,100,135,160,210,265]
[null,"2,000 to 4,000 Vehicles","Over 400","10 MPH","2,000 to 4,000 VehiclesOver 400",100,120,120,160,210,265,320]
[null,"4,001 to 10,000 Vehicles","0-50",null,{"$f":"B117&C117","v":"4,001 to 10,000 Vehicles0-50"},"-","-","-","-","-","-","-"]
[null,"4,001 to 10,000 Vehicles","51 - 100","20 MPH","4,001 to 10,000 Vehicles51 - 100","-",135,135,135,135,160,210]
[null,"4,001 to 10,000 Vehicles","101 - 200","15 MPH","4,001 to 10,000 Vehicles101 - 200","-",135,135,135,160,210,265]
[null,"4,001 to 10,000 Vehicles","201 - 300",null,{"$f":"B120&C120","v":"4,001 to 10,000 Vehicles201 - 300"},135,135,135,160,210,265,320]
[null,"4,001 to 10,000 Vehicles","301 - 400","10 MPH","4,001 to 10,000 Vehicles301 - 400",135,135,135,160,210,265,320]
[null,"4,001 to 10,000 Vehicles","Over 400","5 MPH","4,001 to 10,000 VehiclesOver 400",135,160,160,210,265,320,385]
[null,"Over 10,000 Vehicles","0-50",null,{"$f":"B123&C123","v":"Over 10,000 Vehicles0-50"},"-","-","-","-","-","-","-"]
[null,"Over 10,000 Vehicles","51 - 100","15 MPH","Over 10,000 Vehicles51 - 100","-",135,135,135,160,210,265]
[null,"Over 10,000 Vehicles","101 - 200","10 MPH","Over 10,000 Vehicles101 - 200",135,135,135,160,210,265,320]
[null,"Over 10,000 Vehicles","201 - 300",null,{"$f":"B126&C126","v":"Over 10,000 Vehicles201 - 300"},135,160,160,210,265,320,385]
[null,"Over 10,000 Vehicles","301 - 400","5 MPH","Over 10,000 Vehicles301 - 400",135,160,160,210,265,320,385]
[null,"Over 10,000 Vehicles","Over 400","0 MPH","Over 10,000 VehiclesOver 400",135,210,210,265,320,385,455]
[]
[]
[null,"Right-Turn Lane Warrants (R > 50')  G = 5% Downgrade"]
[null,"Projected 10-Year     Roadway ADT","Right-turn ADT","Assumed Speed Change on Through Lane","Highway Posted Speed"]
[]
[null,null,null,null,null,null,null,null,null,null,null,null,{"$f":"IF(D$4=-5,INDEX(E135:L159,MATCH(F$4,E135:E159,),MATCH(C$3,E135:L135,)),)","v":0}]
[null,null,null,null,null,25,30,35,40,45,50,55]
[null,"Less Than 2,000","0-50",null,{"$f":"B136&C136","v":"Less Than 2,0000-50"},"-","-","-","-","-","-","-"]
[null,"Less Than 2,000","51 - 100",null,{"$f":"B137&C137","v":"Less Than 2,00051 - 100"},"-","-","-","-","-","-","-"]
[null,"Less Than 2,000","101 - 200","20 MPH","Less Than 2,000101 - 200","-",100,100,135,135,160,215]
[null,"Less Than 2,000","201 - 300","15 MPH","Less Than 2,000201 - 300","-",100,100,135,160,215,270]
[null,"Less Than 2,000","301 - 400",null,"Less Than 2,000301 - 400","-",100,100,135,160,215,270]
[null,"Less Than 2,000","Over 400",null,"Less Than 2,000Over 400","-",100,100,135,160,215,270]
[null,"2,000 to 4,000 Vehicles","0-50",null,{"$f":"B142&C142","v":"2,000 to 4,000 Vehicles0-50"},"-","-","-","-","-","-","-"]
[null,"2,000 to 4,000 Vehicles","51 - 100",null,"2,000 to 4,000 Vehicles51 - 100","-","-","-","-","-","-","-"]
[null,"2,000 to 4,000 Vehicles","101 - 200","20 MPH","2,000 to 4,000 Vehicles101 - 200","-",100,100,135,135,160,215]
[null,"2,000 to 4,000 Vehicles","201 - 300",null,"2,000 to 4,000 Vehicles201 - 300","-",100,100,135,160,215,270]
[null,"2,000 to 4,000 Vehicles","301 - 400","15 MPH","2,000 to 4,000 Vehicles301 - 400","-",100,100,135,160,215,270]
[null,"2,000 to 4,000 Vehicles","Over 400","10 MPH","2,000 to 4,000 VehiclesOver 400",100,120,120,160,215,270,330]
[null,"4,001 to 10,000 Vehicles","0-50",null,{"$f":"B148&C148","v":"4,001 to 10,000 Vehicles0-50"},"-","-","-","-","-","-","-"]
[null,"4,001 to 10,000 Vehicles","51 - 100","20 MPH","4,001 to 10,000 Vehicles51 - 100","-",135,135,135,135,160,215]
[null,"4,001 to 10,000 Vehicles","101 - 200","15 MPH","4,001 to 10,000 Vehicles101 - 200","-",135,135,135,160,215,270]
[null,"4,001 to 10,000 Vehicles","201 - 300","10 MPH","4,001 to 10,000 Vehicles201 - 300",135,135,135,160,215,270,330]
[null,"4,001 to 10,000 Vehicles","301 - 400",null,"4,001 to 10,000 Vehicles301 - 400",135,135,135,160,215,270,330]
[null,"4,001 to 10,000 Vehicles","Over 400","5 MPH","4,001 to 10,000 VehiclesOver 400",135,160,160,215,270,330,395]
[null,"Over 10,000 Vehicles","0-50",null,"Over 10,000 Vehicles0-50","-","-","-","-","-","-","-"]
[null,"Over 10,000 Vehicles","51 - 100","15 MPH",{"$f":"B155&C155","v":"Over 10,000 Vehicles51 - 100"},"-",135,135,135,160,215,270]
[null,"Over 10,000 Vehicles","101 - 200","10 MPH","Over 10,000 Vehicles101 - 200",135,135,135,160,215,270,330]
[null,"Over 10,000 Vehicles","201 - 300","5 MPH","Over 10,000 Vehicles201 - 300",135,160,160,215,270,330,395]
[null,"Over 10,000 Vehicles","301 - 400",null,"Over 10,000 Vehicles301 - 400",135,160,160,215,270,330,395]
[null,"Over 10,000 Vehicles","Over 400","0 MPH","Over 10,000 VehiclesOver 400",135,215,215,270,330,395,470]
[]
[]
[]
[null,"Right-Turn Lane Warrants (R > 50')  G = 6% Downgrade"]
[null,"Projected 10-Year     Roadway ADT","Right-turn ADT","Assumed Speed Change on Through Lane","Highway Posted Speed"]
[]
[null,null,null,null,null,null,null,null,null,null,null,null,{"$f":"IF(D$4=-6,INDEX(E167:L191,MATCH(F$4,E167:E191,),MATCH(C$3,E167:L167,)),)","v":0}]
[null,null,null,null,null,25,30,35,40,45,50,55]
[null,"Less Than 2,000","0-50",null,{"$f":"B168&C168","v":"Less Than 2,0000-50"},"-","-","-","-","-","-","-"]
[null,"Less Than 2,000","51 - 100",null,{"$f":"B169&C169","v":"Less Than 2,00051 - 100"},"-","-","-","-","-","-","-"]
[null,"Less Than 2,000","101 - 200","20 MPH","Less Than 2,000101 - 200","-",100,100,135,135,170,220]
[null,"Less Than 2,000","201 - 300",null,"Less Than 2,000201 - 300","-",100,100,135,170,220,275]
[null,"Less Than 2,000","301 - 400",null,"Less Than 2,000301 - 400","-",100,100,135,170,220,275]
[null,"Less Than 2,000","Over 400","15 MPH","Less Than 2,000Over 400","-",100,100,135,170,220,275]
[null,"2,000 to 4,000 Vehicles","0-50",null,{"$f":"B174&C174","v":"2,000 to 4,000 Vehicles0-50"},"-","-","-","-","-","-","-"]
[null,"2,000 to 4,000 Vehicles","51 - 100",null,"2,000 to 4,000 Vehicles51 - 100","-","-","-","-","-","-","-"]
[null,"2,000 to 4,000 Vehicles","101 - 200","20 MPH","2,000 to 4,000 Vehicles101 - 200","-",100,100,135,135,170,220]
[null,"2,000 to 4,000 Vehicles","201 - 300",null,"2,000 to 4,000 Vehicles201 - 300","-",100,100,135,170,220,275]
[null,"2,000 to 4,000 Vehicles","301 - 400","15 MPH","2,000 to 4,000 Vehicles301 - 400","-",100,100,135,170,220,275]
[null,"2,000 to 4,000 Vehicles","Over 400","10 MPH","2,000 to 4,000 VehiclesOver 400",100,125,125,170,220,275,340]
[null,"4,001 to 10,000 Vehicles","0-50",null,{"$f":"B180&C180","v":"4,001 to 10,000 Vehicles0-50"},"-","-","-","-","-","-","-"]
[null,"4,001 to 10,000 Vehicles","51 - 100","20 MPH","4,001 to 10,000 Vehicles51 - 100","-",135,135,135,135,170,220]
[null,"4,001 to 10,000 Vehicles","101 - 200","15 MPH","4,001 to 10,000 Vehicles101 - 200","-",135,135,135,170,220,275]
[null,"4,001 to 10,000 Vehicles","201 - 300",null,"4,001 to 10,000 Vehicles201 - 300",135,135,135,170,220,275,340]
[null,"4,001 to 10,000 Vehicles","301 - 400","10 MPH","4,001 to 10,000 Vehicles301 - 400",135,135,135,170,220,275,340]
[null,"4,001 to 10,000 Vehicles","Over 400","5 MPH","4,001 to 10,000 VehiclesOver 400",135,170,170,220,275,340,405]
[null,"Over 10,000 Vehicles","0-50",null,{"$f":"B186&C186","v":"Over 10,000 Vehicles0-50"},"-","-","-","-","-","-","-"]
[null,"Over 10,000 Vehicles","51 - 100","15 MPH","Over 10,000 Vehicles51 - 100","-",135,135,135,170,220,275]
[null,"Over 10,000 Vehicles","101 - 200","10 MPH","Over 10,000 Vehicles101 - 200",135,135,135,170,220,275,340]
[null,"Over 10,000 Vehicles","201 - 300","5 MPH","Over 10,000 Vehicles201 - 300",135,170,170,220,275,340,405]
[null,"Over 10,000 Vehicles","301 - 400",null,"Over 10,000 Vehicles301 - 400",135,170,170,220,275,340,405]
[null,"Over 10,000 Vehicles","Over 400","0 MPH","Over 10,000 VehiclesOver 400",135,220,220,275,340,405,480]
[]
[]
[null,"Right-Turn Lane Warrants (R > 50')  G = 7% Downgrade"]
[null,"Projected 10-Year     Roadway ADT","Right-turn ADT","Assumed Speed Change on Through Lane","Highway Posted Speed"]
[]
[null,null,null,null,null,null,null,null,null,null,null,null,{"$f":"IF(D$4=-7,INDEX(E198:L222,MATCH(F$4,E198:E222,),MATCH(C$3,E198:L198,)),)","v":0}]
[null,null,null,null,null,25,30,35,40,45,50,55]
[null,"Less Than 2,000","0-50",null,{"$f":"B199&C199","v":"Less Than 2,0000-50"},"-","-","-","-","-","-","-"]
[null,"Less Than 2,000","51 - 100",null,{"$f":"B200&C200","v":"Less Than 2,00051 - 100"},"-","-","-","-","-","-","-"]
[null,"Less Than 2,000","101 - 200","20 MPH","Less Than 2,000101 - 200","-",100,100,135,135,170,225]
[null,"Less Than 2,000","201 - 300",null,"Less Than 2,000201 - 300","-",100,100,135,170,225,285]
[null,"Less Than 2,000","301 - 400",null,"Less Than 2,000301 - 400","-",100,100,135,170,225,285]
[null,"Less Than 2,000","Over 400","15 MPH","Less Than 2,000Over 400","-",100,100,135,170,225,285]
[null,"2,000 to 4,000 Vehicles","0-50",null,{"$f":"B205&C205","v":"2,000 to 4,000 Vehicles0-50"},"-","-","-","-","-","-","-"]
[null,"2,000 to 4,000 Vehicles","51 - 100",null,"2,000 to 4,000 Vehicles51 - 100","-","-","-","-","-","-","-"]
[null,"2,000 to 4,000 Vehicles","101 - 200","20 MPH","2,000 to 4,000 Vehicles101 - 200","-",100,100,135,135,170,225]
[null,"2,000 to 4,000 Vehicles","201 - 300",null,"2,000 to 4,000 Vehicles201 - 300","-",100,100,135,170,225,285]
[null,"2,000 to 4,000 Vehicles","301 - 400","15 MPH","2,000 to 4,000 Vehicles301 - 400","-",100,100,135,170,225,285]
[null,"2,000 to 4,000 Vehicles","Over 400","10 MPH","2,000 to 4,000 VehiclesOver 400",100,125,125,170,225,285,350]
[null,"4,001 to 10,000 Vehicles","0-50",null,{"$f":"B211&C211","v":"4,001 to 10,000 Vehicles0-50"},"-","-","-","-","-","-","-"]
[null,"4,001 to 10,000 Vehicles","51 - 100","20 MPH","4,001 to 10,000 Vehicles51 - 100","-",135,135,135,135,170,225]
[null,"4,001 to 10,000 Vehicles","101 - 200","15 MPH","4,001 to 10,000 Vehicles101 - 200","-",135,135,135,170,225,285]
[null,"4,001 to 10,000 Vehicles","201 - 300",null,"4,001 to 10,000 Vehicles201 - 300",135,135,135,170,225,285,350]
[null,"4,001 to 10,000 Vehicles","301 - 400","10 MPH","4,001 to 10,000 Vehicles301 - 400",135,135,135,170,225,285,350]
[null,"4,001 to 10,000 Vehicles","Over 400","5 MPH","4,001 to 10,000 VehiclesOver 400",135,170,170,225,285,350,420]
[null,"Over 10,000 Vehicles","0-50",null,{"$f":"B217&C217","v":"Over 10,000 Vehicles0-50"},"-","-","-","-","-","-","-"]
[null,"Over 10,000 Vehicles","51 - 100","15 MPH","Over 10,000 Vehicles51 - 100","-",135,135,135,170,225,285]
[null,"Over 10,000 Vehicles","101 - 200","10 MPH","Over 10,000 Vehicles101 - 200",135,135,135,170,225,285,350]
[null,"Over 10,000 Vehicles","201 - 300","5 MPH","Over 10,000 Vehicles201 - 300",135,170,170,225,285,350,420]
[null,"Over 10,000 Vehicles","301 - 400",null,"Over 10,000 Vehicles301 - 400",135,170,170,225,285,350,420]
[null,"Over 10,000 Vehicles","Over 400","0 MPH","Over 10,000 VehiclesOver 400",135,225,225,285,350,420,495]
[]
[]
[null,"Right-Turn Lane Warrants (R > 50')  G = 8% Downgrade"]
[null,"Projected 10-Year     Roadway ADT","Right-turn ADT","Assumed Speed Change on Through Lane","Highway Posted Speed"]
[]
[null,null,null,null,null,null,null,null,null,null,null,null,{"$f":"IF(D$4=-8,INDEX(E229:L253,MATCH(F$4,E229:E253,),MATCH(C$3,E229:L229,)),)","v":0}]
[null,null,null,null,null,25,30,35,40,45,50,55]
[null,"Less Than 2,000","0-50",null,{"$f":"B230&C230","v":"Less Than 2,0000-50"},"-","-","-","-","-","-","-"]
[null,"Less Than 2,000","51 - 100",null,{"$f":"B231&C231","v":"Less Than 2,00051 - 100"},"-","-","-","-","-","-","-"]
[null,"Less Than 2,000","101 - 200","20 MPH","Less Than 2,000101 - 200","-",100,100,135,135,170,230]
[null,"Less Than 2,000","201 - 300",null,"Less Than 2,000201 - 300","-",100,100,135,170,230,290]
[null,"Less Than 2,000","301 - 400",null,"Less Than 2,000301 - 400","-",100,100,135,170,230,290]
[null,"Less Than 2,000","Over 400","15 MPH","Less Than 2,000Over 400","-",100,100,135,170,230,290]
[null,"2,000 to 4,000 Vehicles","0-50",null,{"$f":"B236&C236","v":"2,000 to 4,000 Vehicles0-50"},"-","-","-","-","-","-","-"]
[null,"2,000 to 4,000 Vehicles","51 - 100",null,"2,000 to 4,000 Vehicles51 - 100","-","-","-","-","-","-","-"]
[null,"2,000 to 4,000 Vehicles","101 - 200","20 MPH","2,000 to 4,000 Vehicles101 - 200","-",100,100,135,135,170,230]
[null,"2,000 to 4,000 Vehicles","201 - 300",null,"2,000 to 4,000 Vehicles201 - 300","-",100,100,135,170,230,290]
[null,"2,000 to 4,000 Vehicles","301 - 400","15 MPH","2,000 to 4,000 Vehicles301 - 400","-",100,100,135,170,230,290]
[null,"2,000 to 4,000 Vehicles","Over 400","10 MPH","2,000 to 4,000 VehiclesOver 400",100,130,130,170,230,290,360]
[null,"4,001 to 10,000 Vehicles","0-50",null,{"$f":"B242&C242","v":"4,001 to 10,000 Vehicles0-50"},"-","-","-","-","-","-","-"]
[null,"4,001 to 10,000 Vehicles","51 - 100","20 MPH","4,001 to 10,000 Vehicles51 - 100","-",135,135,135,135,170,230]
[null,"4,001 to 10,000 Vehicles","101 - 200","15 MPH","4,001 to 10,000 Vehicles101 - 200","-",135,135,135,170,230,290]
[null,"4,001 to 10,000 Vehicles","201 - 300",null,{"$f":"B245&C245","v":"4,001 to 10,000 Vehicles201 - 300"},135,135,135,170,230,290,360]
[null,"4,001 to 10,000 Vehicles","301 - 400","10 MPH","4,001 to 10,000 Vehicles301 - 400",135,135,135,170,230,290,360]
[null,"4,001 to 10,000 Vehicles","Over 400","5 MPH","4,001 to 10,000 VehiclesOver 400",135,170,170,230,290,360,430]
[null,"Over 10,000 Vehicles","0-50",null,{"$f":"B248&C248","v":"Over 10,000 Vehicles0-50"},"-","-","-","-","-","-","-"]
[null,"Over 10,000 Vehicles","51 - 100","15 MPH","Over 10,000 Vehicles51 - 100","-",135,135,135,170,230,290]
[null,"Over 10,000 Vehicles","101 - 200","10 MPH","Over 10,000 Vehicles101 - 200",135,135,135,170,230,290,360]
[null,"Over 10,000 Vehicles","201 - 300","5 MPH","Over 10,000 Vehicles201 - 300",135,170,170,230,290,360,430]
[null,"Over 10,000 Vehicles","301 - 400",null,{"$f":"B252&C252","v":"Over 10,000 Vehicles301 - 400"},135,170,170,230,290,360,430]
[null,"Over 10,000 Vehicles","Over 400","0 MPH","Over 10,000 VehiclesOver 400",135,230,230,290,360,430,510]
[]
[]
[null,"Right-Turn Lane Warrants (R > 50')  G = 9% Downgrade"]
[null,"Projected 10-Year     Roadway ADT","Right-turn ADT","Assumed Speed Change on Through Lane","Highway Posted Speed"]
[]
[null,null,null,null,null,null,null,null,null,null,null,null,{"$f":"IF(D$4=-9,INDEX(E260:L284,MATCH(F$4,E260:E284,),MATCH(C$3,E260:L260,)),)","v":0}]
[null,null,null,null,null,25,30,35,40,45,50,55]
[null,"Less Than 2,000","0-50",null,{"$f":"B261&C261","v":"Less Than 2,0000-50"},"-","-","-","-","-","-","-"]
[null,"Less Than 2,000","51 - 100",null,{"$f":"B262&C262","v":"Less Than 2,00051 - 100"},"-","-","-","-","-","-","-"]
[null,"Less Than 2,000","101 - 200","20 MPH","Less Than 2,000101 - 200","-",100,100,135,135,185,240]
[null,"Less Than 2,000","201 - 300",null,"Less Than 2,000201 - 300","-",100,100,135,185,240,300]
[null,"Less Than 2,000","301 - 400",null,"Less Than 2,000301 - 400","-",100,100,135,185,240,300]
[null,"Less Than 2,000","Over 400","15 MPH","Less Than 2,000Over 400","-",100,100,135,185,240,300]
[null,"2,000 to 4,000 Vehicles","0-50",null,{"$f":"B267&C267","v":"2,000 to 4,000 Vehicles0-50"},"-","-","-","-","-","-","-"]
[null,"2,000 to 4,000 Vehicles","51 - 100",null,"2,000 to 4,000 Vehicles51 - 100","-","-","-","-","-","-","-"]
[null,"2,000 to 4,000 Vehicles","101 - 200","20 MPH","2,000 to 4,000 Vehicles101 - 200","-",100,100,135,135,185,240]
[null,"2,000 to 4,000 Vehicles","201 - 300",null,{"$f":"A270&B270","v":"2,000 to 4,000 Vehicles"},"-",100,100,135,185,240,300]
[null,"2,000 to 4,000 Vehicles","301 - 400","15 MPH","2,000 to 4,000 Vehicles301 - 400","-",100,100,135,185,240,300]
[null,"2,000 to 4,000 Vehicles","Over 400","10 MPH","2,000 to 4,000 VehiclesOver 400",100,135,135,185,240,300,370]
[null,"4,001 to 10,000 Vehicles","0-50",null,{"$f":"B273&C273","v":"4,001 to 10,000 Vehicles0-50"},"-","-","-","-","-","-","-"]
[null,"4,001 to 10,000 Vehicles","51 - 100","20 MPH","4,001 to 10,000 Vehicles51 - 100","-",135,135,135,135,185,240]
[null,"4,001 to 10,000 Vehicles","101 - 200","15 MPH","4,001 to 10,000 Vehicles101 - 200","-",135,135,135,185,240,300]
[null,"4,001 to 10,000 Vehicles","201 - 300",null,{"$f":"B276&C276","v":"4,001 to 10,000 Vehicles201 - 300"},135,135,135,185,240,300,370]
[null,"4,001 to 10,000 Vehicles","301 - 400","10 MPH","4,001 to 10,000 Vehicles301 - 400",135,135,135,185,240,300,370]
[null,"4,001 to 10,000 Vehicles","Over 400","5 MPH","4,001 to 10,000 VehiclesOver 400",135,185,185,240,300,370,445]
[null,"Over 10,000 Vehicles","0-50",null,{"$f":"B279&C279","v":"Over 10,000 Vehicles0-50"},"-","-","-","-","-","-","-"]
[null,"Over 10,000 Vehicles","51 - 100","15 MPH","Over 10,000 Vehicles51 - 100","-",135,135,135,185,240,300]
[null,"Over 10,000 Vehicles","101 - 200","10 MPH","Over 10,000 Vehicles101 - 200",135,135,135,185,240,300,370]
[null,"Over 10,000 Vehicles","201 - 300","5 MPH","Over 10,000 Vehicles201 - 300",135,185,185,240,300,370,445]
[null,"Over 10,000 Vehicles","301 - 400",null,{"$f":"A283&B283","v":"Over 10,000 Vehicles"},135,185,185,240,300,370,445]
[null,"Over 10,000 Vehicles","Over 400","0 MPH","Over 10,000 VehiclesOver 400",135,235,240,300,370,445,525]
[]
[]
[null,"Right-Turn Lane Warrants (R > 50') Level G =0%"]
[null,"Projected 10-Year     Roadway ADT","Right-turn ADT","Assumed Speed Change on Through Lane","Highway Posted Speed"]
[]
[null,null,null,null,null,null,null,null,null,null,null,null,{"$f":"IF(D$4=0,INDEX(E291:L315,MATCH(F$4,E291:E315,),MATCH(C$3,E291:L291,)),)","v":{"$error":"#N/A"}}]
[null,null,null,null,null,25,30,35,40,45,50,55]
[null,"Less Than 2,000","0-50",null,{"$f":"B292&C292","v":"Less Than 2,0000-50"},"-","-","-","-","-","-","-"]
[null,"Less Than 2,000","51 - 100",null,{"$f":"B293&C293","v":"Less Than 2,00051 - 100"},"-","-","-","-","-","-","-"]
[null,"Less Than 2,000","101 - 200","20 MPH","Less Than 2,000101 - 200","-",100,100,135,135,150,195]
[null,"Less Than 2,000","201 - 300",null,"Less Than 2,000201 - 300","-",100,100,135,150,195,240]
[null,"Less Than 2,000","301 - 400",null,"Less Than 2,000301 - 400","-",100,100,135,150,195,240]
[null,"Less Than 2,000","Over 400","15 MPH","Less Than 2,000Over 400","-",100,100,135,150,195,240]
[null,"2,000 to 4,000 Vehicles","0-50",null,{"$f":"B298&C298","v":"2,000 to 4,000 Vehicles0-50"},"-","-","-","-","-","-","-"]
[null,"2,000 to 4,000 Vehicles","51 - 100",null,"2,000 to 4,000 Vehicles51 - 100","-","-","-","-","-","-","-"]
[null,"2,000 to 4,000 Vehicles","101 - 200","20 MPH","2,000 to 4,000 Vehicles101 - 200","-",100,100,135,135,150,195]
[null,"2,000 to 4,000 Vehicles","201 - 300",null,"2,000 to 4,000 Vehicles201 - 300","-",100,100,135,150,195,240]
[null,"2,000 to 4,000 Vehicles","301 - 400","15 MPH","2,000 to 4,000 Vehicles301 - 400","-",100,100,135,150,195,240]
[null,"2,000 to 4,000 Vehicles","Over 400","10 MPH","2,000 to 4,000 VehiclesOver 400",100,110,110,150,195,240,295]
[null,"4,001 to 10,000 Vehicles","0-50",null,{"$f":"B304&C304","v":"4,001 to 10,000 Vehicles0-50"},"-","-","-","-","-","-","-"]
[null,"4,001 to 10,000 Vehicles","51 - 100","20 MPH","4,001 to 10,000 Vehicles51 - 100","-",100,135,135,135,150,195]
[null,"4,001 to 10,000 Vehicles","101 - 200","15 MPH","4,001 to 10,000 Vehicles101 - 200","-",115,135,135,150,195,240]
[null,"4,001 to 10,000 Vehicles","201 - 300",null,"4,001 to 10,000 Vehicles201 - 300",135,135,135,150,195,240,295]
[null,"4,001 to 10,000 Vehicles","301 - 400","10 MPH","4,001 to 10,000 Vehicles301 - 400",135,135,135,150,195,240,295]
[null,"4,001 to 10,000 Vehicles","Over 400","5 MPH","4,001 to 10,000 VehiclesOver 400",135,150,150,195,240,295,355]
[null,"Over 10,000 Vehicles","0-50",null,{"$f":"B310&C310","v":"Over 10,000 Vehicles0-50"},"-","-","-","-","-","-","-"]
[null,"Over 10,000 Vehicles","51 - 100","15 MPH","Over 10,000 Vehicles51 - 100","-",115,135,135,150,195,240]
[null,"Over 10,000 Vehicles","101 - 200","10 MPH","Over 10,000 Vehicles101 - 200",135,135,135,150,195,240,295]
[null,"Over 10,000 Vehicles","201 - 300","5 MPH","Over 10,000 Vehicles201 - 300",135,150,150,195,240,295,355]
[null,"Over 10,000 Vehicles","301 - 400",null,"Over 10,000 Vehicles301 - 400",135,150,150,195,240,295,355]
[null,"Over 10,000 Vehicles","Over 400","0 MPH","Over 10,000 VehiclesOver 400",135,170,195,240,295,355,415]
[]
[]
[null,"Right-Turn Lane Warrants (R > 50') Level G =1%"]
[null,"Projected 10-Year     Roadway ADT","Right-turn ADT","Assumed Speed Change on Through Lane","Highway Posted Speed"]
[]
[null,null,null,null,null,null,null,null,null,null,null,null,{"$f":"IF(D$4=1,INDEX(E322:L346,MATCH(F$4,E322:E346,),MATCH(C$3,E322:L322,)),)","v":0}]
[null,null,null,null,null,25,30,35,40,45,50,55]
[null,"Less Than 2,000","0-50",null,{"$f":"B323&C323","v":"Less Than 2,0000-50"},"-","-","-","-","-","-","-"]
[null,"Less Than 2,000","51 - 100",null,{"$f":"B324&C324","v":"Less Than 2,00051 - 100"},"-","-","-","-","-","-","-"]
[null,"Less Than 2,000","101 - 200","20 MPH","Less Than 2,000101 - 200","-",100,100,135,135,150,195]
[null,"Less Than 2,000","201 - 300",null,"Less Than 2,000201 - 300","-",100,100,135,150,195,240]
[null,"Less Than 2,000","301 - 400",null,"Less Than 2,000301 - 400","-",100,100,135,150,195,240]
[null,"Less Than 2,000","Over 400","15 MPH","Less Than 2,000Over 400","-",100,100,135,150,195,240]
[null,"2,000 to 4,000 Vehicles","0-50",null,{"$f":"B329&C329","v":"2,000 to 4,000 Vehicles0-50"},"-","-","-","-","-","-","-"]
[null,"2,000 to 4,000 Vehicles","51 - 100",null,"2,000 to 4,000 Vehicles51 - 100","-","-","-","-","-","-","-"]
[null,"2,000 to 4,000 Vehicles","101 - 200","20 MPH","2,000 to 4,000 Vehicles101 - 200","-",100,100,135,135,150,195]
[null,"2,000 to 4,000 Vehicles","201 - 300",null,"2,000 to 4,000 Vehicles201 - 300","-",100,100,135,150,195,240]
[null,"2,000 to 4,000 Vehicles","301 - 400","15 MPH","2,000 to 4,000 Vehicles301 - 400","-",100,100,135,150,195,240]
[null,"2,000 to 4,000 Vehicles","Over 400","10 MPH","2,000 to 4,000 VehiclesOver 400",100,110,110,150,195,240,295]
[null,"4,001 to 10,000 Vehicles","0-50",null,{"$f":"B335&C335","v":"4,001 to 10,000 Vehicles0-50"},"-","-","-","-","-","-","-"]
[null,"4,001 to 10,000 Vehicles","51 - 100","20 MPH","4,001 to 10,000 Vehicles51 - 100","-",100,135,135,135,150,195]
[null,"4,001 to 10,000 Vehicles","101 - 200","15 MPH","4,001 to 10,000 Vehicles101 - 200","-",115,135,135,150,195,240]
[null,"4,001 to 10,000 Vehicles","201 - 300",null,"4,001 to 10,000 Vehicles201 - 300",135,135,135,150,195,240,295]
[null,"4,001 to 10,000 Vehicles","301 - 400","10 MPH","4,001 to 10,000 Vehicles301 - 400",135,135,135,150,195,240,295]
[null,"4,001 to 10,000 Vehicles","Over 400","5 MPH","4,001 to 10,000 VehiclesOver 400",135,150,150,195,240,295,355]
[null,"Over 10,000 Vehicles","0-50",null,{"$f":"B341&C341","v":"Over 10,000 Vehicles0-50"},"-","-","-","-","-","-","-"]
[null,"Over 10,000 Vehicles","51 - 100","15 MPH","Over 10,000 Vehicles51 - 100","-",115,135,135,150,195,240]
[null,"Over 10,000 Vehicles","101 - 200","10 MPH","Over 10,000 Vehicles101 - 200",135,135,135,150,195,240,295]
[null,"Over 10,000 Vehicles","201 - 300","5 MPH","Over 10,000 Vehicles201 - 300",135,150,150,195,240,295,355]
[null,"Over 10,000 Vehicles","301 - 400",null,"Over 10,000 Vehicles301 - 400",135,150,150,195,240,295,355]
[null,"Over 10,000 Vehicles","Over 400","0 MPH","Over 10,000 VehiclesOver 400",135,170,195,240,295,355,415]
[]
[]
[null,"Right-Turn Lane Warrants (R > 50') Level G =2%"]
[null,"Projected 10-Year     Roadway ADT","Right-turn ADT","Assumed Speed Change on Through Lane","Highway Posted Speed"]
[]
[null,null,null,null,null,null,null,null,null,null,null,null,{"$f":"IF(D$4=2,INDEX(E353:L377,MATCH(F$4,E353:E377,),MATCH(C$3,E353:L353,)),)","v":0}]
[null,null,null,null,null,25,30,35,40,45,50,55]
[null,"Less Than 2,000","0-50",null,{"$f":"B354&C354","v":"Less Than 2,0000-50"},"-","-","-","-","-","-","-"]
[null,"Less Than 2,000","51 - 100",null,{"$f":"B355&C355","v":"Less Than 2,00051 - 100"},"-","-","-","-","-","-","-"]
[null,"Less Than 2,000","101 - 200","20 MPH","Less Than 2,000101 - 200","-",100,100,135,135,150,195]
[null,"Less Than 2,000","201 - 300",null,"Less Than 2,000201 - 300","-",100,100,135,150,195,240]
[null,"Less Than 2,000","301 - 400",null,"Less Than 2,000301 - 400","-",100,100,135,150,195,240]
[null,"Less Than 2,000","Over 400","15 MPH","Less Than 2,000Over 400","-",100,100,135,150,195,240]
[null,"2,000 to 4,000 Vehicles","0-50",null,{"$f":"B360&C360","v":"2,000 to 4,000 Vehicles0-50"},"-","-","-","-","-","-","-"]
[null,"2,000 to 4,000 Vehicles","51 - 100",null,"2,000 to 4,000 Vehicles51 - 100","-","-","-","-","-","-","-"]
[null,"2,000 to 4,000 Vehicles","101 - 200","20 MPH","2,000 to 4,000 Vehicles101 - 200","-",100,100,135,135,150,195]
[null,"2,000 to 4,000 Vehicles","201 - 300",null,"2,000 to 4,000 Vehicles201 - 300","-",100,100,135,150,195,240]
[null,"2,000 to 4,000 Vehicles","301 - 400","15 MPH","2,000 to 4,000 Vehicles301 - 400","-",100,100,135,150,195,240]
[null,"2,000 to 4,000 Vehicles","Over 400","10 MPH","2,000 to 4,000 VehiclesOver 400",100,110,110,150,195,240,295]
[null,"4,001 to 10,000 Vehicles","0-50",null,{"$f":"B366&C366","v":"4,001 to 10,000 Vehicles0-50"},"-","-","-","-","-","-","-"]
[null,"4,001 to 10,000 Vehicles","51 - 100","20 MPH","4,001 to 10,000 Vehicles51 - 100","-",100,135,135,135,150,195]
[null,"4,001 to 10,000 Vehicles","101 - 200","15 MPH","4,001 to 10,000 Vehicles101 - 200","-",115,135,135,150,195,240]
[null,"4,001 to 10,000 Vehicles","201 - 300",null,"4,001 to 10,000 Vehicles201 - 300",135,135,135,150,195,240,295]
[null,"4,001 to 10,000 Vehicles","301 - 400","10 MPH","4,001 to 10,000 Vehicles301 - 400",135,135,135,150,195,240,295]
[null,"4,001 to 10,000 Vehicles","Over 400","5 MPH","4,001 to 10,000 VehiclesOver 400",135,150,150,195,240,295,355]
[null,"Over 10,000 Vehicles","0-50",null,{"$f":"B372&C372","v":"Over 10,000 Vehicles0-50"},"-","-","-","-","-","-","-"]
[null,"Over 10,000 Vehicles","51 - 100","15 MPH","Over 10,000 Vehicles51 - 100","-",115,135,135,150,195,240]
[null,"Over 10,000 Vehicles","101 - 200","10 MPH","Over 10,000 Vehicles101 - 200",135,135,135,150,195,240,295]
[null,"Over 10,000 Vehicles","201 - 300","5 MPH","Over 10,000 Vehicles201 - 300",135,150,150,195,240,295,355]
[null,"Over 10,000 Vehicles","301 - 400",null,"Over 10,000 Vehicles301 - 400",135,150,150,195,240,295,355]
[null,"Over 10,000 Vehicles","Over 400","0 MPH","Over 10,000 VehiclesOver 400",135,170,195,240,295,355,415]
[]
[]
[null,"Right-Turn Lane Warrants (R > 50')  G = 3% Upgrade"]
[null,"Projected 10-Year     Roadway ADT","Right-turn ADT","Assumed Speed Change on Through Lane","Highway Posted Speed"]
[]
[null,null,null,null,null,null,null,null,null,null,null,null,{"$f":"IF(D$4=3,INDEX(E384:L408,MATCH(F$4,E384:E408,),MATCH(C$3,E384:L384,)),)","v":0}]
[null,null,null,null,null,25,30,35,40,45,50,55]
[null,"Less Than 2,000","0-50",null,{"$f":"B385&C385","v":"Less Than 2,0000-50"},"-","-","-","-","-","-","-"]
[null,"Less Than 2,000","51 - 100",null,{"$f":"B386&C386","v":"Less Than 2,00051 - 100"},"-","-","-","-","-","-","-"]
[null,"Less Than 2,000","101 - 200","20 MPH",{"$f":"B387&C387","v":"Less Than 2,000101 - 200"},"-",100,100,135,135,140,185]
[null,"Less Than 2,000","201 - 300",null,"Less Than 2,000201 - 300","-",100,100,135,140,185,230]
[null,"Less Than 2,000","301 - 400",null,"Less Than 2,000301 - 400","-",100,100,135,140,185,230]
[null,"Less Than 2,000","Over 400","15 MPH","Less Than 2,000Over 400","-",100,100,135,140,185,230]
[null,"2,000 to 4,000 Vehicles","0-50",null,{"$f":"B391&C391","v":"2,000 to 4,000 Vehicles0-50"},"-","-","-","-","-","-","-"]
[null,"2,000 to 4,000 Vehicles","51 - 100",null,"2,000 to 4,000 Vehicles51 - 100","-","-","-","-","-","-","-"]
[null,"2,000 to 4,000 Vehicles","101 - 200","20 MPH","2,000 to 4,000 Vehicles101 - 200","-",100,100,135,135,140,185]
[null,"2,000 to 4,000 Vehicles","201 - 300",null,"2,000 to 4,000 Vehicles201 - 300","-",100,100,135,140,185,230]
[null,"2,000 to 4,000 Vehicles","301 - 400","15 MPH","2,000 to 4,000 Vehicles301 - 400","-",100,100,135,140,185,230]
[null,"2,000 to 4,000 Vehicles","Over 400","10 MPH","2,000 to 4,000 VehiclesOver 400",100,105,105,140,185,230,275]
[null,"4,001 to 10,000 Vehicles","0-50",null,{"$f":"B397&C397","v":"4,001 to 10,000 Vehicles0-50"},"-","-","-","-","-","-","-"]
[null,"4,001 to 10,000 Vehicles","51 - 100","20 MPH","4,001 to 10,000 Vehicles51 - 100","-",135,135,135,135,140,185]
[null,"4,001 to 10,000 Vehicles","101 - 200","15 MPH","4,001 to 10,000 Vehicles101 - 200","-",135,135,135,140,185,230]
[null,"4,001 to 10,000 Vehicles","201 - 300",null,"4,001 to 10,000 Vehicles201 - 300",135,135,135,140,185,230,275]
[null,"4,001 to 10,000 Vehicles","301 - 400","10 MPH","4,001 to 10,000 Vehicles301 - 400",135,135,135,140,185,230,275]
[null,"4,001 to 10,000 Vehicles","Over 400","5 MPH","4,001 to 10,000 VehiclesOver 400",135,140,140,185,230,275,330]
[null,"Over 10,000 Vehicles","0-50",null,{"$f":"B403&C403","v":"Over 10,000 Vehicles0-50"},"-","-","-","-","-","-","-"]
[null,"Over 10,000 Vehicles","51 - 100","15 MPH","Over 10,000 Vehicles51 - 100","-",135,135,135,140,185,230]
[null,"Over 10,000 Vehicles","101 - 200","10 MPH","Over 10,000 Vehicles101 - 200",135,135,135,140,185,230,275]
[null,"Over 10,000 Vehicles","201 - 300","5 MPH","Over 10,000 Vehicles201 - 300",135,140,140,185,230,275,330]
[null,"Over 10,000 Vehicles","301 - 400",null,"Over 10,000 Vehicles301 - 400",135,140,140,185,230,275,330]
[null,"Over 10,000 Vehicles","Over 400","0 MPH","Over 10,000 VehiclesOver 400",135,185,185,230,275,330,390]
[]
[]
[null,"Right-Turn Lane Warrants (R > 50')  G = 4% Upgrade"]
[null,"Projected 10-Year     Roadway ADT","Right-turn ADT","Assumed Speed Change on Through Lane","Highway Posted Speed"]
[]
[null,null,null,null,null,null,null,null,null,null,null,null,{"$f":"IF(D$4=4,INDEX(E415:L439,MATCH(F$4,E415:E439,),MATCH(C$3,E415:L415,)),)","v":0}]
[null,null,null,null,null,25,30,35,40,45,50,55]
[null,"Less Than 2,000","0-50",null,{"$f":"B416&C416","v":"Less Than 2,0000-50"},"-","-","-","-","-","-","-"]
[null,"Less Than 2,000","51 - 100",null,{"$f":"B417&C417","v":"Less Than 2,00051 - 100"},"-","-","-","-","-","-","-"]
[null,"Less Than 2,000","101 - 200","20 MPH","Less Than 2,000101 - 200","-",100,100,135,135,140,180]
[null,"Less Than 2,000","201 - 300",null,"Less Than 2,000201 - 300","-",100,100,135,140,180,225]
[null,"Less Than 2,000","301 - 400",null,"Less Than 2,000301 - 400","-",100,100,135,140,180,225]
[null,"Less Than 2,000","Over 400","15 MPH","Less Than 2,000Over 400","-",100,100,135,140,180,225]
[null,"2,000 to 4,000 Vehicles","0-50",null,{"$f":"B422&C422","v":"2,000 to 4,000 Vehicles0-50"},"-","-","-","-","-","-","-"]
[null,"2,000 to 4,000 Vehicles","51 - 100",null,"2,000 to 4,000 Vehicles51 - 100","-","-","-","-","-","-","-"]
[null,"2,000 to 4,000 Vehicles","101 - 200","20 MPH","2,000 to 4,000 Vehicles101 - 200","-",100,100,135,135,140,180]
[null,"2,000 to 4,000 Vehicles","201 - 300",null,"2,000 to 4,000 Vehicles201 - 300","-",100,100,135,140,180,225]
[null,"2,000 to 4,000 Vehicles","301 - 400","15 MPH","2,000 to 4,000 Vehicles301 - 400","-",100,100,135,140,180,225]
[null,"2,000 to 4,000 Vehicles","Over 400","10 MPH","2,000 to 4,000 VehiclesOver 400",100,105,105,140,180,225,270]
[null,"4,001 to 10,000 Vehicles","0-50",null,{"$f":"B428&C428","v":"4,001 to 10,000 Vehicles0-50"},"-","-","-","-","-","-","-"]
[null,"4,001 to 10,000 Vehicles","51 - 100","20 MPH","4,001 to 10,000 Vehicles51 - 100","-",135,135,135,135,140,180]
[null,"4,001 to 10,000 Vehicles","101 - 200","15 MPH","4,001 to 10,000 Vehicles101 - 200","-",135,135,135,140,180,225]
[null,"4,001 to 10,000 Vehicles","201 - 300",null,"4,001 to 10,000 Vehicles201 - 300",135,135,135,140,180,225,270]
[null,"4,001 to 10,000 Vehicles","301 - 400","10 MPH","4,001 to 10,000 Vehicles301 - 400",135,135,135,140,180,225,270]
[null,"4,001 to 10,000 Vehicles","Over 400","5 MPH","4,001 to 10,000 VehiclesOver 400",135,140,140,180,225,270,325]
[null,"Over 10,000 Vehicles","0-50",null,{"$f":"B434&C434","v":"Over 10,000 Vehicles0-50"},"-","-","-","-","-","-","-"]
[null,"Over 10,000 Vehicles","51 - 100","15 MPH","Over 10,000 Vehicles51 - 100","-",135,135,135,140,180,225]
[null,"Over 10,000 Vehicles","101 - 200","10 MPH","Over 10,000 Vehicles101 - 200",135,135,135,140,180,225,270]
[null,"Over 10,000 Vehicles","201 - 300","5 MPH","Over 10,000 Vehicles201 - 300",135,140,140,180,225,270,325]
[null,"Over 10,000 Vehicles","301 - 400",null,"Over 10,000 Vehicles301 - 400",135,140,140,180,225,270,325]
[null,"Over 10,000 Vehicles","Over 400","0 MPH","Over 10,000 VehiclesOver 400",135,180,180,225,270,325,380]
[]
[]
[null,"Right-Turn Lane Warrants (R > 50')  G = 5% Upgrade"]
[null,"Projected 10-Year     Roadway ADT","Right-turn ADT","Assumed Speed Change on Through Lane","Highway Posted Speed"]
[]
[null,null,null,null,null,null,null,null,null,null,null,null,{"$f":"IF(D$4=5,INDEX(E446:L470,MATCH(F$4,E446:E470,),MATCH(C$3,E446:L446,)),)","v":0}]
[null,null,null,null,null,25,30,35,40,45,50,55]
[null,"Less Than 2,000","0-50",null,{"$f":"B447&C447","v":"Less Than 2,0000-50"},"-","-","-","-","-","-","-"]
[null,"Less Than 2,000","51 - 100",null,{"$f":"B448&C448","v":"Less Than 2,00051 - 100"},"-","-","-","-","-","-","-"]
[null,"Less Than 2,000","101 - 200","20 MPH","Less Than 2,000101 - 200","-",100,100,135,135,140,175]
[null,"Less Than 2,000","201 - 300",null,"Less Than 2,000201 - 300","-",100,100,135,140,175,220]
[null,"Less Than 2,000","301 - 400",null,"Less Than 2,000301 - 400","-",100,100,135,140,175,220]
[null,"Less Than 2,000","Over 400","15 MPH","Less Than 2,000Over 400","-",100,100,135,140,175,220]
[null,"2,000 to 4,000 Vehicles","0-50",null,{"$f":"B453&C453","v":"2,000 to 4,000 Vehicles0-50"},"-","-","-","-","-","-","-"]
[null,"2,000 to 4,000 Vehicles","51 - 100",null,"2,000 to 4,000 Vehicles51 - 100","-","-","-","-","-","-","-"]
[null,"2,000 to 4,000 Vehicles","101 - 200","20 MPH","2,000 to 4,000 Vehicles101 - 200","-",100,100,135,135,140,175]
[null,"2,000 to 4,000 Vehicles","201 - 300",null,"2,000 to 4,000 Vehicles201 - 300","-",100,100,135,140,175,220]
[null,"2,000 to 4,000 Vehicles","301 - 400","15 MPH","2,000 to 4,000 Vehicles301 - 400","-",100,100,135,140,175,220]
[null,"2,000 to 4,000 Vehicles","Over 400","10 MPH","2,000 to 4,000 VehiclesOver 400",100,105,105,140,175,220,265]
[null,"4,001 to 10,000 Vehicles","0-50",null,{"$f":"B459&C459","v":"4,001 to 10,000 Vehicles0-50"},"-","-","-","-","-","-","-"]
[null,"4,001 to 10,000 Vehicles","51 - 100","20 MPH","4,001 to 10,000 Vehicles51 - 100","-",135,135,135,135,140,175]
[null,"4,001 to 10,000 Vehicles","101 - 200","15 MPH","4,001 to 10,000 Vehicles101 - 200","-",135,135,135,140,175,220]
[null,"4,001 to 10,000 Vehicles","201 - 300",null,"4,001 to 10,000 Vehicles201 - 300",135,135,135,140,175,220,265]
[null,"4,001 to 10,000 Vehicles","301 - 400","10 MPH","4,001 to 10,000 Vehicles301 - 400",135,135,135,140,175,220,265]
[null,"4,001 to 10,000 Vehicles","Over 400","5 MPH","4,001 to 10,000 VehiclesOver 400",135,140,140,175,220,265,320]
[null,"Over 10,000 Vehicles","0-50",null,{"$f":"B465&C465","v":"Over 10,000 Vehicles0-50"},"-","-","-","-","-","-","-"]
[null,"Over 10,000 Vehicles","51 - 100","15 MPH","Over 10,000 Vehicles51 - 100","-",135,135,135,140,175,220]
[null,"Over 10,000 Vehicles","101 - 200","10 MPH","Over 10,000 Vehicles101 - 200",135,135,135,140,175,220,265]
[null,"Over 10,000 Vehicles","201 - 300","5 MPH","Over 10,000 Vehicles201 - 300",135,140,140,175,220,265,320]
[null,"Over 10,000 Vehicles","301 - 400",null,"Over 10,000 Vehicles301 - 400",135,140,140,175,220,265,320]
[null,"Over 10,000 Vehicles","Over 400","0 MPH","Over 10,000 VehiclesOver 400",135,175,175,220,265,320,375]
[]
[]
[null,"Right-Turn Lane Warrants (R > 50')  G = 6% Upgrade"]
[null,"Projected 10-Year     Roadway ADT","Right-turn ADT","Assumed Speed Change on Through Lane","Highway Posted Speed"]
[]
[null,null,null,null,null,null,null,null,null,null,null,null,{"$f":"IF(D$4=6,INDEX(E477:L501,MATCH(F$4,E477:E501,),MATCH(C$3,E477:L477,)),)","v":0}]
[null,null,null,null,null,25,30,35,40,45,50,55]
[null,"Less Than 2,000","0-50",null,{"$f":"B478&C478","v":"Less Than 2,0000-50"},"-","-","-","-","-","-","-"]
[null,"Less Than 2,000","51 - 100",null,{"$f":"B479&C479","v":"Less Than 2,00051 - 100"},"-","-","-","-","-","-","-"]
[null,"Less Than 2,000","101 - 200","20 MPH","Less Than 2,000101 - 200","-",100,100,135,135,135,175]
[null,"Less Than 2,000","201 - 300",null,"Less Than 2,000201 - 300","-",100,100,135,135,175,215]
[null,"Less Than 2,000","301 - 400",null,"Less Than 2,000301 - 400","-",100,100,135,135,175,215]
[null,"Less Than 2,000","Over 400","15 MPH","Less Than 2,000Over 400","-",100,100,135,135,175,215]
[null,"2,000 to 4,000 Vehicles","0-50",null,{"$f":"B484&C484","v":"2,000 to 4,000 Vehicles0-50"},"-","-","-","-","-","-","-"]
[null,"2,000 to 4,000 Vehicles","51 - 100",null,"2,000 to 4,000 Vehicles51 - 100","-","-","-","-","-","-","-"]
[null,"2,000 to 4,000 Vehicles","101 - 200","20 MPH","2,000 to 4,000 Vehicles101 - 200","-",100,100,135,135,135,175]
[null,"2,000 to 4,000 Vehicles","201 - 300",null,"2,000 to 4,000 Vehicles201 - 300","-",100,100,135,135,175,215]
[null,"2,000 to 4,000 Vehicles","301 - 400","15 MPH","2,000 to 4,000 Vehicles301 - 400","-",100,100,135,135,175,215]
[null,"2,000 to 4,000 Vehicles","Over 400","10 MPH","2,000 to 4,000 VehiclesOver 400",100,100,100,135,175,215,260]
[null,"4,001 to 10,000 Vehicles","0-50",null,{"$f":"B490&C490","v":"4,001 to 10,000 Vehicles0-50"},"-","-","-","-","-","-","-"]
[null,"4,001 to 10,000 Vehicles","51 - 100","20 MPH","4,001 to 10,000 Vehicles51 - 100","-",135,135,135,135,135,175]
[null,"4,001 to 10,000 Vehicles","101 - 200","15 MPH","4,001 to 10,000 Vehicles101 - 200","-",135,135,135,135,175,215]
[null,"4,001 to 10,000 Vehicles","201 - 300",null,"4,001 to 10,000 Vehicles201 - 300",135,135,135,135,175,215,260]
[null,"4,001 to 10,000 Vehicles","301 - 400","10 MPH","4,001 to 10,000 Vehicles301 - 400",135,135,135,135,175,215,260]
[null,"4,001 to 10,000 Vehicles","Over 400","5 MPH","4,001 to 10,000 VehiclesOver 400",135,135,135,175,215,260,315]
[null,"Over 10,000 Vehicles","0-50",null,null,"-","-","-","-","-","-","-"]
[null,"Over 10,000 Vehicles","51 - 100","15 MPH","Over 10,000 Vehicles51 - 100","-",135,135,135,135,175,215]
[null,"Over 10,000 Vehicles","101 - 200","10 MPH","Over 10,000 Vehicles101 - 200",135,135,135,135,175,215,260]
[null,"Over 10,000 Vehicles","201 - 300","5 MPH","Over 10,000 Vehicles201 - 300",135,135,135,175,215,260,315]
[null,"Over 10,000 Vehicles","301 - 400",null,"Over 10,000 Vehicles301 - 400",135,135,135,175,215,260,315]
[null,"Over 10,000 Vehicles","Over 400","0 MPH","Over 10,000 VehiclesOver 400",135,175,175,215,260,315,365]
[]
[]
[null,"Right-Turn Lane Warrants (R > 50')  G = 7% Upgrade"]
[null,"Projected 10-Year     Roadway ADT","Right-turn ADT","Assumed Speed Change on Through Lane","Highway Posted Speed"]
[]
[null,null,null,null,null,null,null,null,null,null,null,null,{"$f":"IF(D$4=7,INDEX(E508:L532,MATCH(F$4,E508:E532,),MATCH(C$3,E508:L508,)),)","v":0}]
[null,null,null,null,null,25,30,35,40,45,50,55]
[null,"Less Than 2,000","0-50",null,{"$f":"B509&C509","v":"Less Than 2,0000-50"},"-","-","-","-","-","-","-"]
[null,"Less Than 2,000","51 - 100",null,{"$f":"B510&C510","v":"Less Than 2,00051 - 100"},"-","-","-","-","-","-","-"]
[null,"Less Than 2,000","101 - 200","20 MPH","Less Than 2,000101 - 200","-",100,100,135,135,135,170]
[null,"Less Than 2,000","201 - 300",null,"Less Than 2,000201 - 300","-",100,100,135,135,170,210]
[null,"Less Than 2,000","301 - 400",null,"Less Than 2,000301 - 400","-",100,100,135,135,170,210]
[null,"Less Than 2,000","Over 400","15 MPH","Less Than 2,000Over 400","-",100,100,135,135,170,210]
[null,"2,000 to 4,000 Vehicles","0-50",null,{"$f":"B515&C515","v":"2,000 to 4,000 Vehicles0-50"},"-","-","-","-","-","-","-"]
[null,"2,000 to 4,000 Vehicles","51 - 100",null,"2,000 to 4,000 Vehicles51 - 100","-","-","-","-","-","-","-"]
[null,"2,000 to 4,000 Vehicles","101 - 200","20 MPH","2,000 to 4,000 Vehicles101 - 200","-",100,100,135,135,135,170]
[null,"2,000 to 4,000 Vehicles","201 - 300",null,"2,000 to 4,000 Vehicles201 - 300","-",100,100,135,135,170,210]
[null,"2,000 to 4,000 Vehicles","301 - 400","15 MPH","2,000 to 4,000 Vehicles301 - 400","-",100,100,135,135,170,210]
[null,"2,000 to 4,000 Vehicles","Over 400","10 MPH","2,000 to 4,000 VehiclesOver 400",100,100,100,135,170,210,260]
[null,"4,001 to 10,000 Vehicles","0-50",null,{"$f":"B521&C521","v":"4,001 to 10,000 Vehicles0-50"},"-","-","-","-","-","-","-"]
[null,"4,001 to 10,000 Vehicles","51 - 100","20 MPH","4,001 to 10,000 Vehicles51 - 100","-",135,135,135,135,135,170]
[null,"4,001 to 10,000 Vehicles","101 - 200","15 MPH","4,001 to 10,000 Vehicles101 - 200","-",135,135,135,135,170,210]
[null,"4,001 to 10,000 Vehicles","201 - 300",null,"4,001 to 10,000 Vehicles201 - 300",135,135,135,135,170,210,260]
[null,"4,001 to 10,000 Vehicles","301 - 400","10 MPH","4,001 to 10,000 Vehicles301 - 400",135,135,135,135,170,210,260]
[null,"4,001 to 10,000 Vehicles","Over 400","5 MPH","4,001 to 10,000 VehiclesOver 400",135,135,135,170,210,260,305]
[null,"Over 10,000 Vehicles","0-50",null,{"$f":"B527&C527","v":"Over 10,000 Vehicles0-50"},"-","-","-","-","-","-","-"]
[null,"Over 10,000 Vehicles","51 - 100","15 MPH","Over 10,000 Vehicles51 - 100","-",135,135,135,135,170,210]
[null,"Over 10,000 Vehicles","101 - 200","10 MPH","Over 10,000 Vehicles101 - 200",135,135,135,135,170,210,260]
[null,"Over 10,000 Vehicles","201 - 300","5 MPH","Over 10,000 Vehicles201 - 300",135,135,135,170,210,260,305]
[null,"Over 10,000 Vehicles","301 - 400",null,"Over 10,000 Vehicles301 - 400",135,135,135,170,210,260,305]
[null,"Over 10,000 Vehicles","Over 400","0 MPH","Over 10,000 VehiclesOver 400",135,170,170,210,260,305,360]
[]
[]
[null,"Right-Turn Lane Warrants (R > 50')  G = 8% Upgrade"]
[null,"Projected 10-Year     Roadway ADT","Right-turn ADT","Assumed Speed Change on Through Lane","Highway Posted Speed"]
[]
[null,null,null,null,null,null,null,null,null,null,null,null,{"$f":"IF(D$4=8,INDEX(E539:L563,MATCH(F$4,E539:E563,),MATCH(C$3,E539:L539,)),)","v":0}]
[null,null,null,null,null,25,30,35,40,45,50,55]
[null,"Less Than 2,000","0-50",null,{"$f":"B540&C540","v":"Less Than 2,0000-50"},"-","-","-","-","-","-","-"]
[null,"Less Than 2,000","51 - 100",null,{"$f":"B541&C541","v":"Less Than 2,00051 - 100"},"-","-","-","-","-","-","-"]
[null,"Less Than 2,000","101 - 200","20 MPH","Less Than 2,000101 - 200","-",100,100,135,135,135,170]
[null,"Less Than 2,000","201 - 300",null,"Less Than 2,000201 - 300","-",100,100,135,135,170,210]
[null,"Less Than 2,000","301 - 400",null,"Less Than 2,000301 - 400","-",100,100,135,135,170,210]
[null,"Less Than 2,000","Over 400","15 MPH","Less Than 2,000Over 400","-",100,100,135,135,170,210]
[null,"2,000 to 4,000 Vehicles","0-50",null,{"$f":"B546&C546","v":"2,000 to 4,000 Vehicles0-50"},"-","-","-","-","-","-","-"]
[null,"2,000 to 4,000 Vehicles","51 - 100",null,"2,000 to 4,000 Vehicles51 - 100","-","-","-","-","-","-","-"]
[null,"2,000 to 4,000 Vehicles","101 - 200","20 MPH","2,000 to 4,000 Vehicles101 - 200","-",100,100,135,135,135,170]
[null,"2,000 to 4,000 Vehicles","201 - 300",null,"2,000 to 4,000 Vehicles201 - 300","-",100,100,135,135,170,210]
[null,"2,000 to 4,000 Vehicles","301 - 400","15 MPH","2,000 to 4,000 Vehicles301 - 400","-",100,100,135,135,170,210]
[null,"2,000 to 4,000 Vehicles","Over 400","10 MPH","2,000 to 4,000 VehiclesOver 400",100,100,100,135,170,210,255]
[null,"4,001 to 10,000 Vehicles","0-50",null,{"$f":"B552&C552","v":"4,001 to 10,000 Vehicles0-50"},"-","-","-","-","-","-","-"]
[null,"4,001 to 10,000 Vehicles","51 - 100","20 MPH","4,001 to 10,000 Vehicles51 - 100","-",135,135,135,135,135,170]
[null,"4,001 to 10,000 Vehicles","101 - 200","15 MPH","4,001 to 10,000 Vehicles101 - 200","-",135,135,135,135,170,210]
[null,"4,001 to 10,000 Vehicles","201 - 300",null,"4,001 to 10,000 Vehicles201 - 300",135,135,135,135,170,210,255]
[null,"4,001 to 10,000 Vehicles","301 - 400","10 MPH","4,001 to 10,000 Vehicles301 - 400",135,135,135,135,170,210,255]
[null,"4,001 to 10,000 Vehicles","Over 400","5 MPH","4,001 to 10,000 VehiclesOver 400",135,135,135,170,210,255,300]
[null,"Over 10,000 Vehicles","0-50",null,{"$f":"B558&C558","v":"Over 10,000 Vehicles0-50"},"-","-","-","-","-","-","-"]
[null,"Over 10,000 Vehicles","51 - 100","15 MPH","Over 10,000 Vehicles51 - 100","-",135,135,135,135,170,210]
[null,"Over 10,000 Vehicles","101 - 200","10 MPH","Over 10,000 Vehicles101 - 200",135,135,135,135,170,210,255]
[null,"Over 10,000 Vehicles","201 - 300","5 MPH","Over 10,000 Vehicles201 - 300",135,135,135,170,210,255,300]
[null,"Over 10,000 Vehicles","301 - 400",null,"Over 10,000 Vehicles301 - 400",135,135,135,170,210,255,300]
[null,"Over 10,000 Vehicles","Over 400","0 MPH","Over 10,000 VehiclesOver 400",135,170,170,210,255,300,355]
[]
[]
[null,"Right-Turn Lane Warrants (R > 50')  G = 9% Upgrade"]
[null,"Projected 10-Year     Roadway ADT","Right-turn ADT","Assumed Speed Change on Through Lane","Highway Posted Speed"]
[]
[null,null,null,null,null,null,null,null,null,null,null,null,{"$f":"IF(D$4=9,INDEX(E570:L594,MATCH(F$4,E570:E594,),MATCH(C$3,E570:L570,)),)","v":0}]
[null,null,null,null,null,25,30,35,40,45,50,55]
[null,"Less Than 2,000","0-50",null,{"$f":"B571&C571","v":"Less Than 2,0000-50"},"-","-","-","-","-","-","-"]
[null,"Less Than 2,000","51 - 100",null,{"$f":"B572&C572","v":"Less Than 2,00051 - 100"},"-","-","-","-","-","-","-"]
[null,"Less Than 2,000","101 - 200","20 MPH","Less Than 2,000101 - 200","-",100,100,135,135,135,165]
[null,"Less Than 2,000","201 - 300",null,"Less Than 2,000201 - 300","-",100,100,135,135,165,205]
[null,"Less Than 2,000","301 - 400",null,"Less Than 2,000301 - 400","-",100,100,135,135,165,205]
[null,"Less Than 2,000","Over 400","15 MPH","Less Than 2,000Over 400","-",100,100,135,135,165,205]
[null,"2,000 to 4,000 Vehicles","0-50",null,{"$f":"B577&C577","v":"2,000 to 4,000 Vehicles0-50"},"-","-","-","-","-","-","-"]
[null,"2,000 to 4,000 Vehicles","51 - 100",null,"2,000 to 4,000 Vehicles51 - 100","-","-","-","-","-","-","-"]
[null,"2,000 to 4,000 Vehicles","101 - 200","20 MPH","2,000 to 4,000 Vehicles101 - 200","-",100,100,135,135,135,165]
[null,"2,000 to 4,000 Vehicles","201 - 300",null,"2,000 to 4,000 Vehicles201 - 300","-",100,100,135,135,165,205]
[null,"2,000 to 4,000 Vehicles","301 - 400","15 MPH","2,000 to 4,000 Vehicles301 - 400","-",100,100,135,135,165,205]
[null,"2,000 to 4,000 Vehicles","Over 400","10 MPH","2,000 to 4,000 VehiclesOver 400",100,100,100,135,165,205,250]
[null,"4,001 to 10,000 Vehicles","0-50",null,{"$f":"B583&C583","v":"4,001 to 10,000 Vehicles0-50"},"-","-","-","-","-","-","-"]
[null,"4,001 to 10,000 Vehicles","51 - 100","20 MPH","4,001 to 10,000 Vehicles51 - 100","-",135,135,135,135,135,165]
[null,"4,001 to 10,000 Vehicles","101 - 200","15 MPH","4,001 to 10,000 Vehicles101 - 200","-",135,135,135,135,165,205]
[null,"4,001 to 10,000 Vehicles","201 - 300",null,"4,001 to 10,000 Vehicles201 - 300",135,135,135,135,165,205,250]
[null,"4,001 to 10,000 Vehicles","301 - 400","10 MPH","4,001 to 10,000 Vehicles301 - 400",135,135,135,135,165,205,250]
[null,"4,001 to 10,000 Vehicles","Over 400","5 MPH","4,001 to 10,000 VehiclesOver 400",135,135,135,165,205,250,295]
[null,"Over 10,000 Vehicles","0-50",null,{"$f":"B589&C589","v":"Over 10,000 Vehicles0-50"},"-","-","-","-","-","-","-"]
[null,"Over 10,000 Vehicles","51 - 100","15 MPH","Over 10,000 Vehicles51 - 100","-",135,135,135,135,165,205]
[null,"Over 10,000 Vehicles","101 - 200","10 MPH","Over 10,000 Vehicles101 - 200",135,135,135,135,165,205,250]
[null,"Over 10,000 Vehicles","201 - 300","5 MPH","Over 10,000 Vehicles201 - 300",135,135,135,165,205,250,295]
[null,"Over 10,000 Vehicles","301 - 400",null,"Over 10,000 Vehicles301 - 400",135,135,135,165,205,250,295]
[null,"Over 10,000 Vehicles","Over 400","0 MPH","Over 10,000 VehiclesOver 400",135,165,165,205,250,295,350]

{"sheet":"R ≤ 50+Calcs","index":6,"n_rows":591,"n_cols":19,"rows_kept":591,"cut":false,"hidden":true,"merged":[[593,2,593,10],[594,2,594,10],[595,1,595,10],[596,1,596,10],[591,1,591,10],[592,1,592,10]]}
[null,"Projected ADT",{"$f":"IF('Aux Lane Inputs-Tab 2'!K11<2000,E1,IF('Aux Lane Inputs-Tab 2'!K11<4000,E2,IF('Aux Lane Inputs-Tab 2'!K11<10000,E3,IF('Aux Lane Inputs-Tab 2'!K11>10000,E4,0))))","v":"Less Than 2,000"},null,"Less Than 2,000",null,null,null,"If Heavy veh >=10%"]
[null,"RT Turn ADT",{"$f":"'Aux Lane Inputs-Tab 2'!K14","v":"0-50"},null,"2,000 to 4,000 Vehicles",null,"RTL Length",{"$f":"IF(C4>9,0,IF(C4<-9,0,SUM(A6:S6)+I2))","v":{"$error":"#N/A"}},{"$f":"IF(AND('Aux Lane Inputs-Tab 2'!E17>=10,SUM(A6:S6)>0),25,0)","v":{"$error":"#N/A"}},null,{"$f":"IF(2001<'R ≤ 50+Calcs'!C2>4000,'R ≤ 50+Calcs'!F2,0)","v":0}]
[null,"Posted SL",{"$f":"'Aux Lane Inputs-Tab 2'!K6","v":0},null,"4,001 to 10,000 Vehicles",null,null,null,{"$f":"IF(#REF!=\"RCP\",INDEX($BK$69:$BY$89,MATCH(#REF!,$BK$69:$BK$89,),MATCH(#REF!,$BK$69:$BY$69,)),IF(#REF!=\"ERCP\",INDEX($BZ$69:$CM$89,MATCH(#REF!,$BZ$69:$BZ$89,),MATCH(#REF!,$BZ$69:$CM$69,)),INDEX($BK$97:$BW$116,MATCH(#REF!,$BK$97:$BK$115,),MATCH(#REF!,$BK$97:$BW$97,))))","v":{"$error":"#REF!"}},"Example of Indexing"]
[null,"Roadway Slope",{"$f":"IF(-3<='Aux Lane Inputs-Tab 2'!K16*100<=3,0,ROUNDDOWN('Aux Lane Inputs-Tab 2'!K16*100,0))","v":0},{"$f":"ROUNDUP(C4,0)","v":0},"Over 10,000 Vehicles",{"$f":"C1&C2","v":"Less Than 2,0000-50"}]
[-1,-2,-3,-4,-5,-6,-7,-8,-9,0,1,2,3,4,5,6,7,8,9]
[{"$f":"M10","v":0},{"$f":"M41","v":0},{"$f":"M72","v":0},{"$f":"M103","v":0},{"$f":"M134","v":0},{"$f":"M165","v":0},{"$f":"M196","v":0},{"$f":"M227","v":0},{"$f":"M258","v":0},{"$f":"M289","v":{"$error":"#N/A"}},{"$f":"M319","v":0},{"$f":"M349","v":0},{"$f":"M380","v":0},{"$f":"M411","v":0},{"$f":"M442","v":0},{"$f":"M473","v":0},{"$f":"M504","v":0},{"$f":"M535","v":0},{"$f":"M566","v":0}]
[null,"Right-Turn Lane Warrants (R ≤ 50')  Level G = 1% "]
[null,"Projected 10-Year     Roadway ADT","Right-turn ADT","Assumed Speed Change on Through Lane",null,"Highway Posted Speed"]
[]
[null,null,null,null,null,null,null,null,null,null,null,null,{"$f":"IF(D$4=-1,INDEX(E11:L35,MATCH(F$4,E11:E35,),MATCH(C$3,E11:L11,)),)","v":0}]
[null,null,null,null,null,25,30,35,40,45,50,55]
[null,"Less Than 2,000","0-50",null,{"$f":"B12&C12","v":"Less Than 2,0000-50"},"-","-","-","-","-","-","-"]
[null,"Less Than 2,000","51 - 100",null,{"$f":"B13&C13","v":"Less Than 2,00051 - 100"},"-","-","-","-","-","-","-"]
[null,"Less Than 2,000","101 - 200","20 MPH","Less Than 2,000101 - 200",100,100,100,150,160,195,240]
[null,"Less Than 2,000","201 - 300",null,"Less Than 2,000201 - 300",100,100,125,160,195,240,290]
[null,"Less Than 2,000","301 - 400",null,"Less Than 2,000301 - 400",100,100,125,160,195,240,290]
[null,"Less Than 2,000","Over 400","15 MPH","Less Than 2,000Over 400",100,100,125,160,195,240,290]
[null,"2,000 to 4,000 Vehicles","0-50",null,{"$f":"B18&C18","v":"2,000 to 4,000 Vehicles0-50"},"-","-","-","-","-","-","-"]
[null,"2,000 to 4,000 Vehicles","51 - 100",null,"2,000 to 4,000 Vehicles51 - 100","-","-","-","-","-","-","-"]
[null,"2,000 to 4,000 Vehicles","101 - 200","20 MPH","2,000 to 4,000 Vehicles101 - 200",100,100,100,150,160,195,240]
[null,"2,000 to 4,000 Vehicles","201 - 300",null,"2,000 to 4,000 Vehicles201 - 300",100,100,125,160,195,240,290]
[null,"2,000 to 4,000 Vehicles","301 - 400","15 MPH","2,000 to 4,000 Vehicles301 - 400",100,100,125,160,195,240,290]
[null,"2,000 to 4,000 Vehicles","Over 400","10 MPH","2,000 to 4,000 VehiclesOver 400",100,120,160,195,240,290,340]
[null,"4,001 to 10,000 Vehicles","0-50",null,{"$f":"B24&C24","v":"4,001 to 10,000 Vehicles0-50"},"-","-","-","-","-","-","-"]
[null,"4,001 to 10,000 Vehicles","51 - 100","20 MPH","4,001 to 10,000 Vehicles51 - 100",150,150,150,150,160,195,240]
[null,"4,001 to 10,000 Vehicles","101 - 200","15 MPH","4,001 to 10,000 Vehicles101 - 200",150,150,150,160,195,240,290]
[null,"4,001 to 10,000 Vehicles","201 - 300","10 MPH","4,001 to 10,000 Vehicles201 - 300",150,150,160,195,240,290,340]
[null,"4,001 to 10,000 Vehicles","301 - 400",null,"4,001 to 10,000 Vehicles301 - 400",150,150,160,195,240,290,340]
[null,"4,001 to 10,000 Vehicles","Over 400","5 MPH","4,001 to 10,000 VehiclesOver 400",150,150,195,240,290,340,400]
[null,"Over 10,000 Vehicles","0-50",null,{"$f":"B30&C30","v":"Over 10,000 Vehicles0-50"},"-","-","-","-","-","-","-"]
[null,"Over 10,000 Vehicles","51 - 100","15 MPH","Over 10,000 Vehicles51 - 100",150,150,150,160,195,240,290]
[null,"Over 10,000 Vehicles","101 - 200","10 MPH","Over 10,000 Vehicles101 - 200",150,150,160,195,240,290,340]
[null,"Over 10,000 Vehicles","201 - 300","5 MPH","Over 10,000 Vehicles201 - 300",150,150,195,240,290,340,400]
[null,"Over 10,000 Vehicles","301 - 400",null,"Over 10,000 Vehicles301 - 400",150,150,195,240,290,340,400]
[null,"Over 10,000 Vehicles","Over 400","0 MPH","Over 10,000 VehiclesOver 400",160,175,240,290,340,400,460]
[]
[]
[null,"Right-Turn Lane Warrants (R ≤ 50')  Level G = 2% "]
[null,"Projected 10-Year     Roadway ADT","Right-turn ADT","Assumed Speed Change on Through Lane",null,"Highway Posted Speed"]
[]
[null,null,null,null,null,null,null,null,null,null,null,null,{"$f":"IF(D$4=-2,INDEX(E42:L66,MATCH(F$4,E42:E66,),MATCH(C$3,E42:L42,)),)","v":0}]
[null,null,null,null,null,25,30,35,40,45,50,55]
[null,"Less Than 2,000","0-50",null,{"$f":"B43&C43","v":"Less Than 2,0000-50"},"-","-","-","-","-","-","-"]
[null,"Less Than 2,000","51 - 100",null,{"$f":"B44&C44","v":"Less Than 2,00051 - 100"},"-","-","-","-","-","-","-"]
[null,"Less Than 2,000","101 - 200","20 MPH","Less Than 2,000101 - 200",100,100,100,150,160,195,240]
[null,"Less Than 2,000","201 - 300",null,"Less Than 2,000201 - 300",100,100,125,160,195,240,290]
[null,"Less Than 2,000","301 - 400",null,"Less Than 2,000301 - 400",100,100,125,160,195,240,290]
[null,"Less Than 2,000","Over 400","15 MPH","Less Than 2,000Over 400",100,100,125,160,195,240,290]
[null,"2,000 to 4,000 Vehicles","0-50",null,{"$f":"B49&C49","v":"2,000 to 4,000 Vehicles0-50"},"-","-","-","-","-","-","-"]
[null,"2,000 to 4,000 Vehicles","51 - 100",null,"2,000 to 4,000 Vehicles51 - 100","-","-","-","-","-","-","-"]
[null,"2,000 to 4,000 Vehicles","101 - 200","20 MPH","2,000 to 4,000 Vehicles101 - 200",100,100,100,150,160,195,240]
[null,"2,000 to 4,000 Vehicles","201 - 300",null,"2,000 to 4,000 Vehicles201 - 300",100,100,125,160,195,240,290]
[null,"2,000 to 4,000 Vehicles","301 - 400","15 MPH","2,000 to 4,000 Vehicles301 - 400",100,100,125,160,195,240,290]
[null,"2,000 to 4,000 Vehicles","Over 400","10 MPH","2,000 to 4,000 VehiclesOver 400",100,120,160,195,240,290,340]
[null,"4,001 to 10,000 Vehicles","0-50",null,{"$f":"B55&C55","v":"4,001 to 10,000 Vehicles0-50"},"-","-","-","-","-","-","-"]
[null,"4,001 to 10,000 Vehicles","51 - 100","20 MPH","4,001 to 10,000 Vehicles51 - 100",150,150,150,150,160,195,240]
[null,"4,001 to 10,000 Vehicles","101 - 200","15 MPH","4,001 to 10,000 Vehicles101 - 200",150,150,150,160,195,240,290]
[null,"4,001 to 10,000 Vehicles","201 - 300","10 MPH","4,001 to 10,000 Vehicles201 - 300",150,150,160,195,240,290,340]
[null,"4,001 to 10,000 Vehicles","301 - 400",null,"4,001 to 10,000 Vehicles301 - 400",150,150,160,195,240,290,340]
[null,"4,001 to 10,000 Vehicles","Over 400","5 MPH","4,001 to 10,000 VehiclesOver 400",150,150,195,240,290,340,400]
[null,"Over 10,000 Vehicles","0-50",null,{"$f":"B61&C61","v":"Over 10,000 Vehicles0-50"},"-","-","-","-","-","-","-"]
[null,"Over 10,000 Vehicles","51 - 100","15 MPH","Over 10,000 Vehicles51 - 100",150,150,150,160,195,240,290]
[null,"Over 10,000 Vehicles","101 - 200","10 MPH","Over 10,000 Vehicles101 - 200",150,150,160,195,240,290,340]
[null,"Over 10,000 Vehicles","201 - 300","5 MPH","Over 10,000 Vehicles201 - 300",150,150,195,240,290,340,400]
[null,"Over 10,000 Vehicles","301 - 400",null,"Over 10,000 Vehicles301 - 400",150,150,195,240,290,340,400]
[null,"Over 10,000 Vehicles","Over 400","0 MPH","Over 10,000 VehiclesOver 400",160,175,240,290,340,400,460]
[]
[]
[null,"Right-Turn Lane Warrants (R ≤ 50')  G = 3% Downgrade"]
[null,"Projected 10-Year     Roadway ADT","Right-turn ADT","Assumed Speed Change on Through Lane",null,"Highway Posted Speed"]
[]
[null,null,null,null,null,null,null,null,null,null,null,null,{"$f":"IF(D$4=-3,INDEX(E73:L97,MATCH(F$4,E73:E97,),MATCH(C$3,E73:L73,)),)","v":0}]
[null,null,null,null,null,25,30,35,40,45,50,55]
[null,"Less Than 2,000","0-50",null,{"$f":"B74&C74","v":"Less Than 2,0000-50"},"-","-","-","-","-","-","-"]
[null,"Less Than 2,000","51 - 100",null,"Less Than 2,00051 - 100","-","-","-","-","-","-","-"]
[null,"Less Than 2,000","101 - 200","20 MPH","Less Than 2,000101 - 200",100,100,100,150,165,205,255]
[null,"Less Than 2,000","201 - 300",null,"Less Than 2,000201 - 300",100,100,100,150,165,205,255]
[null,"Less Than 2,000","301 - 400",null,"Less Than 2,000301 - 400",100,100,130,165,205,255,305]
[null,"Less Than 2,000","Over 400","15 MPH","Less Than 2,000Over 400",100,100,130,165,205,255,305]
[null,"2,000 to 4,000 Vehicles","0-50",null,{"$f":"B80&C80","v":"2,000 to 4,000 Vehicles0-50"},"-","-","-","-","-","-","-"]
[null,"2,000 to 4,000 Vehicles","51 - 100",null,"2,000 to 4,000 Vehicles51 - 100","-","-","-","-","-","-","-"]
[null,"2,000 to 4,000 Vehicles","101 - 200","20 MPH","2,000 to 4,000 Vehicles101 - 200",100,100,100,150,165,205,255]
[null,"2,000 to 4,000 Vehicles","201 - 300",null,"2,000 to 4,000 Vehicles201 - 300",100,100,130,165,205,255,305]
[null,"2,000 to 4,000 Vehicles","301 - 400","15 MPH","2,000 to 4,000 Vehicles301 - 400",100,100,130,165,205,255,305]
[null,"2,000 to 4,000 Vehicles","Over 400","10 MPH","2,000 to 4,000 VehiclesOver 400",100,105,165,205,255,305,365]
[null,"4,001 to 10,000 Vehicles","0-50",null,{"$f":"B86&C86","v":"4,001 to 10,000 Vehicles0-50"},"-","-","-","-","-","-","-"]
[null,"4,001 to 10,000 Vehicles","51 - 100","20 MPH","4,001 to 10,000 Vehicles51 - 100",150,150,150,150,165,205,255]
[null,"4,001 to 10,000 Vehicles","101 - 200","15 MPH","4,001 to 10,000 Vehicles101 - 200",150,150,150,165,205,255,305]
[null,"4,001 to 10,000 Vehicles","201 - 300","10 MPH","4,001 to 10,000 Vehicles201 - 300",150,150,165,205,255,305,365]
[null,"4,001 to 10,000 Vehicles","301 - 400",null,"4,001 to 10,000 Vehicles301 - 400",150,150,165,205,255,305,365]
[null,"4,001 to 10,000 Vehicles","Over 400","5 MPH","4,001 to 10,000 VehiclesOver 400",150,150,205,255,305,365,425]
[null,"Over 10,000 Vehicles","0-50",null,{"$f":"B92&C92","v":"Over 10,000 Vehicles0-50"},"-","-","-","-","-","-","-"]
[null,"Over 10,000 Vehicles","51 - 100","15 MPH","Over 10,000 Vehicles51 - 100",150,150,150,165,205,255,305]
[null,"Over 10,000 Vehicles","101 - 200","10 MPH","Over 10,000 Vehicles101 - 200",150,150,165,205,255,305,365]
[null,"Over 10,000 Vehicles","201 - 300","5 MPH","Over 10,000 Vehicles201 - 300",150,150,205,255,305,365,425]
[null,"Over 10,000 Vehicles","301 - 400",null,"Over 10,000 Vehicles301 - 400",150,150,205,255,305,365,425]
[null,"Over 10,000 Vehicles","Over 400","0 MPH","Over 10,000 VehiclesOver 400",165,185,255,305,365,425,495]
[]
[]
[null,"Right-Turn Lane Warrants (R ≤ 50')  G = 4% Downgrade"]
[null,"Projected 10-Year     Roadway ADT","Right-turn ADT","Assumed Speed Change on Through Lane",null,"Highway Posted Speed"]
[]
[null,null,null,null,null,null,null,null,null,null,null,null,{"$f":"IF(D$4=-4,INDEX(E104:L128,MATCH(F$4,E104:E128,),MATCH(C$3,E104:L104,)),)","v":0}]
[null,null,null,null,null,25,30,35,40,45,50,55]
[null,"Less Than 2,000","0-50",null,{"$f":"B105&C105","v":"Less Than 2,0000-50"},"-","-","-","-","-","-","-"]
[null,"Less Than 2,000","51 - 100",null,{"$f":"B106&C106","v":"Less Than 2,00051 - 100"},"-","-","-","-","-","-","-"]
[null,"Less Than 2,000","101 - 200","20 MPH","Less Than 2,000101 - 200",100,100,100,150,170,210,260]
[null,"Less Than 2,000","201 - 300",null,"Less Than 2,000201 - 300",100,100,130,170,210,260,315]
[null,"Less Than 2,000","301 - 400",null,"Less Than 2,000301 - 400",100,100,130,170,210,260,315]
[null,"Less Than 2,000","Over 400","15 MPH","Less Than 2,000Over 400",100,100,130,170,210,260,315]
[null,"2,000 to 4,000 Vehicles","0-50",null,{"$f":"B111&C111","v":"2,000 to 4,000 Vehicles0-50"},"-","-","-","-","-","-","-"]
[null,"2,000 to 4,000 Vehicles","51 - 100",null,"2,000 to 4,000 Vehicles51 - 100","-","-","-","-","-","-","-"]
[null,"2,000 to 4,000 Vehicles","101 - 200","20 MPH","2,000 to 4,000 Vehicles101 - 200",100,100,100,150,170,210,260]
[null,"2,000 to 4,000 Vehicles","201 - 300",null,"2,000 to 4,000 Vehicles201 - 300",100,100,130,170,210,260,315]
[null,"2,000 to 4,000 Vehicles","301 - 400","15 MPH","2,000 to 4,000 Vehicles301 - 400",100,100,130,170,210,260,315]
[null,"2,000 to 4,000 Vehicles","Over 400","10 MPH","2,000 to 4,000 VehiclesOver 400",100,110,170,210,260,315,370]
[null,"4,001 to 10,000 Vehicles","0-50",null,{"$f":"B117&C117","v":"4,001 to 10,000 Vehicles0-50"},"-","-","-","-","-","-","-"]
[null,"4,001 to 10,000 Vehicles","51 - 100","20 MPH","4,001 to 10,000 Vehicles51 - 100",150,150,150,150,170,210,260]
[null,"4,001 to 10,000 Vehicles","101 - 200","15 MPH","4,001 to 10,000 Vehicles101 - 200",150,150,150,170,210,260,315]
[null,"4,001 to 10,000 Vehicles","201 - 300","10 MPH","4,001 to 10,000 Vehicles201 - 300",150,150,170,210,260,315,370]
[null,"4,001 to 10,000 Vehicles","301 - 400",null,"4,001 to 10,000 Vehicles301 - 400",150,150,170,210,260,315,370]
[null,"4,001 to 10,000 Vehicles","Over 400","5 MPH","4,001 to 10,000 VehiclesOver 400",150,150,210,260,315,370,435]
[null,"Over 10,000 Vehicles","0-50",null,{"$f":"B123&C123","v":"Over 10,000 Vehicles0-50"},"-","-","-","-","-","-","-"]
[null,"Over 10,000 Vehicles","51 - 100","15 MPH","Over 10,000 Vehicles51 - 100",150,150,150,170,210,260,315]
[null,"Over 10,000 Vehicles","101 - 200","10 MPH","Over 10,000 Vehicles101 - 200",150,150,170,210,260,315,370]
[null,"Over 10,000 Vehicles","201 - 300","5 MPH","Over 10,000 Vehicles201 - 300",150,150,210,260,315,370,435]
[null,"Over 10,000 Vehicles","301 - 400",null,"Over 10,000 Vehicles301 - 400",150,150,210,260,315,370,435]
[null,"Over 10,000 Vehicles","Over 400","0 MPH","Over 10,000 VehiclesOver 400",170,185,260,315,370,435,505]
[]
[]
[null,"Right-Turn Lane Warrants (R ≤ 50')  G = 5% Downgrade"]
[null,"Projected 10-Year     Roadway ADT","Right-turn ADT","Assumed Speed Change on Through Lane",null,"Highway Posted Speed"]
[]
[null,null,null,null,null,null,null,null,null,null,null,null,{"$f":"IF(D$4=-5,INDEX(E135:L159,MATCH(F$4,E135:E159,),MATCH(C$3,E135:L135,)),)","v":0}]
[null,null,null,null,null,25,30,35,40,45,50,55]
[null,"Less Than 2,000","0-50",null,{"$f":"B136&C136","v":"Less Than 2,0000-50"},"-","-","-","-","-","-","-"]
[null,"Less Than 2,000","51 - 100",null,{"$f":"B137&C137","v":"Less Than 2,00051 - 100"},"-","-","-","-","-","-","-"]
[null,"Less Than 2,000","101 - 200","20 MPH","Less Than 2,000101 - 200",100,100,100,150,170,215,265]
[null,"Less Than 2,000","201 - 300",null,"Less Than 2,000201 - 300",100,100,135,170,215,265,320]
[null,"Less Than 2,000","301 - 400",null,"Less Than 2,000301 - 400",100,100,135,170,215,265,320]
[null,"Less Than 2,000","Over 400","15 MPH","Less Than 2,000Over 400",100,100,135,170,215,265,320]
[null,"2,000 to 4,000 Vehicles","0-50",null,{"$f":"B142&C142","v":"2,000 to 4,000 Vehicles0-50"},"-","-","-","-","-","-","-"]
[null,"2,000 to 4,000 Vehicles","51 - 100",null,"2,000 to 4,000 Vehicles51 - 100","-","-","-","-","-","-","-"]
[null,"2,000 to 4,000 Vehicles","101 - 200","20 MPH","2,000 to 4,000 Vehicles101 - 200",100,100,100,150,170,215,265]
[null,"2,000 to 4,000 Vehicles","201 - 300",null,"2,000 to 4,000 Vehicles201 - 300",100,100,135,170,215,265,320]
[null,"2,000 to 4,000 Vehicles","301 - 400","15 MPH","2,000 to 4,000 Vehicles301 - 400",100,100,135,170,215,265,320]
[null,"2,000 to 4,000 Vehicles","Over 400","10 MPH","2,000 to 4,000 VehiclesOver 400",100,105,170,215,265,320,380]
[null,"4,001 to 10,000 Vehicles","0-50",null,{"$f":"B148&C148","v":"4,001 to 10,000 Vehicles0-50"},"-","-","-","-","-","-","-"]
[null,"4,001 to 10,000 Vehicles","51 - 100","20 MPH","4,001 to 10,000 Vehicles51 - 100",150,150,150,150,170,215,265]
[null,"4,001 to 10,000 Vehicles","101 - 200","15 MPH","4,001 to 10,000 Vehicles101 - 200",150,150,150,170,215,265,320]
[null,"4,001 to 10,000 Vehicles","201 - 300","10 MPH","4,001 to 10,000 Vehicles201 - 300",150,150,170,215,265,320,380]
[null,"4,001 to 10,000 Vehicles","301 - 400",null,"4,001 to 10,000 Vehicles301 - 400",150,150,170,215,265,320,380]
[null,"4,001 to 10,000 Vehicles","Over 400","5 MPH","4,001 to 10,000 VehiclesOver 400",150,150,215,265,320,380,445]
[null,"Over 10,000 Vehicles","0-50",null,{"$f":"B154&C154","v":"Over 10,000 Vehicles0-50"},"-","-","-","-","-","-","-"]
[null,"Over 10,000 Vehicles","51 - 100","15 MPH","Over 10,000 Vehicles51 - 100",150,150,150,170,215,265,320]
[null,"Over 10,000 Vehicles","101 - 200","10 MPH","Over 10,000 Vehicles101 - 200",150,150,170,215,265,320,380]
[null,"Over 10,000 Vehicles","201 - 300","5 MPH","Over 10,000 Vehicles201 - 300",150,150,215,265,320,380,445]
[null,"Over 10,000 Vehicles","301 - 400",null,"Over 10,000 Vehicles301 - 400",150,150,215,265,320,380,445]
[null,"Over 10,000 Vehicles","Over 400","0 MPH","Over 10,000 VehiclesOver 400",170,190,265,320,380,445,520]
[]
[]
[null,"Right-Turn Lane Warrants (R ≤ 50')  G = 6% Downgrade"]
[null,"Projected 10-Year     Roadway ADT","Right-turn ADT","Assumed Speed Change on Through Lane",null,"Highway Posted Speed"]
[]
[null,null,null,null,null,null,null,null,null,null,null,null,{"$f":"IF(D$4=-6,INDEX(E166:L190,MATCH(F$4,E166:E190,),MATCH(C$3,E166:L166,)),)","v":0}]
[null,null,null,null,null,25,30,35,40,45,50,55]
[null,"Less Than 2,000","0-50",null,{"$f":"B167&C167","v":"Less Than 2,0000-50"},"-","-","-","-","-","-","-"]
[null,"Less Than 2,000","51 - 100",null,{"$f":"B168&C168","v":"Less Than 2,00051 - 100"},"-","-","-","-","-","-","-"]
[null,"Less Than 2,000","101 - 200","20 MPH","Less Than 2,000101 - 200",100,100,105,150,175,220,270]
[null,"Less Than 2,000","201 - 300",null,"Less Than 2,000201 - 300",100,100,135,175,220,270,330]
[null,"Less Than 2,000","301 - 400",null,"Less Than 2,000301 - 400",100,100,135,175,220,270,330]
[null,"Less Than 2,000","Over 400","15 MPH","Less Than 2,000Over 400",100,100,135,175,220,270,330]
[null,"2,000 to 4,000 Vehicles","0-50",null,{"$f":"B173&C173","v":"2,000 to 4,000 Vehicles0-50"},"-","-","-","-","-","-","-"]
[null,"2,000 to 4,000 Vehicles","51 - 100",null,"2,000 to 4,000 Vehicles51 - 100","-","-","-","-","-","-","-"]
[null,"2,000 to 4,000 Vehicles","101 - 200","20 MPH","2,000 to 4,000 Vehicles101 - 200",100,100,105,150,175,220,270]
[null,"2,000 to 4,000 Vehicles","201 - 300",null,"2,000 to 4,000 Vehicles201 - 300",100,105,135,175,220,270,330]
[null,"2,000 to 4,000 Vehicles","301 - 400","15 MPH","2,000 to 4,000 Vehicles301 - 400",100,105,135,175,220,270,330]
[null,"2,000 to 4,000 Vehicles","Over 400","10 MPH","2,000 to 4,000 VehiclesOver 400",105,140,175,220,270,330,390]
[null,"4,001 to 10,000 Vehicles","0-50",null,{"$f":"B179&C179","v":"4,001 to 10,000 Vehicles0-50"},"-","-","-","-","-","-","-"]
[null,"4,001 to 10,000 Vehicles","51 - 100","20 MPH","4,001 to 10,000 Vehicles51 - 100",150,150,150,150,175,220,270]
[null,"4,001 to 10,000 Vehicles","101 - 200","15 MPH","4,001 to 10,000 Vehicles101 - 200",150,150,150,175,220,270,330]
[null,"4,001 to 10,000 Vehicles","201 - 300","10 MPH","4,001 to 10,000 Vehicles201 - 300",150,150,175,220,270,330,390]
[null,"4,001 to 10,000 Vehicles","301 - 400",null,"4,001 to 10,000 Vehicles301 - 400",150,150,175,220,270,330,390]
[null,"4,001 to 10,000 Vehicles","Over 400","5 MPH","4,001 to 10,000 VehiclesOver 400",150,150,220,270,330,390,460]
[null,"Over 10,000 Vehicles","0-50",null,{"$f":"B185&C185","v":"Over 10,000 Vehicles0-50"},"-","-","-","-","-","-","-"]
[null,"Over 10,000 Vehicles","51 - 100","15 MPH","Over 10,000 Vehicles51 - 100",150,150,150,175,220,270,330]
[null,"Over 10,000 Vehicles","101 - 200","10 MPH","Over 10,000 Vehicles101 - 200",150,150,175,220,270,330,390]
[null,"Over 10,000 Vehicles","201 - 300","5 MPH","Over 10,000 Vehicles201 - 300",150,150,220,270,330,390,460]
[null,"Over 10,000 Vehicles","301 - 400",null,"Over 10,000 Vehicles301 - 400",150,150,220,270,330,390,460]
[null,"Over 10,000 Vehicles","Over 400","0 MPH","Over 10,000 VehiclesOver 400",175,195,270,330,390,460,535]
[]
[]
[null,"Right-Turn Lane Warrants (R ≤ 50')  G = 7% Downgrade"]
[null,"Projected 10-Year     Roadway ADT","Right-turn ADT","Assumed Speed Change on Through Lane",null,"Highway Posted Speed"]
[]
[null,null,null,null,null,null,null,null,null,null,null,null,{"$f":"IF(D$4=-7,INDEX(E197:L221,MATCH(F$4,E197:E221,),MATCH(C$3,E197:L197,)),)","v":0}]
[null,null,null,null,null,25,30,35,40,45,50,55]
[null,"Less Than 2,000","0-50",null,{"$f":"B198&C198","v":"Less Than 2,0000-50"},"-","-","-","-","-","-","-"]
[null,"Less Than 2,000","51 - 100",null,{"$f":"B199&C199","v":"Less Than 2,00051 - 100"},"-","-","-","-","-","-","-"]
[null,"Less Than 2,000","101 - 200","20 MPH","Less Than 2,000101 - 200",100,100,105,150,180,225,280]
[null,"Less Than 2,000","201 - 300",null,"Less Than 2,000201 - 300",100,100,140,180,225,280,335]
[null,"Less Than 2,000","301 - 400",null,"Less Than 2,000301 - 400",100,100,140,180,225,280,335]
[null,"Less Than 2,000","Over 400","15 MPH","Less Than 2,000Over 400",100,100,140,180,225,280,335]
[null,"2,000 to 4,000 Vehicles","0-50",null,{"$f":"B204&C204","v":"2,000 to 4,000 Vehicles0-50"},"-","-","-","-","-","-","-"]
[null,"2,000 to 4,000 Vehicles","51 - 100",null,"2,000 to 4,000 Vehicles51 - 100","-","-","-","-","-","-","-"]
[null,"2,000 to 4,000 Vehicles","101 - 200","20 MPH","2,000 to 4,000 Vehicles101 - 200",100,100,105,150,180,225,280]
[null,"2,000 to 4,000 Vehicles","201 - 300",null,"2,000 to 4,000 Vehicles201 - 300",100,100,140,180,225,280,335]
[null,"2,000 to 4,000 Vehicles","301 - 400","15 MPH","2,000 to 4,000 Vehicles301 - 400",100,100,140,180,225,280,335]
[null,"2,000 to 4,000 Vehicles","Over 400","10 MPH","2,000 to 4,000 VehiclesOver 400",105,115,180,225,280,335,400]
[null,"4,001 to 10,000 Vehicles","0-50",null,{"$f":"B210&C210","v":"4,001 to 10,000 Vehicles0-50"},"-","-","-","-","-","-","-"]
[null,"4,001 to 10,000 Vehicles","51 - 100","20 MPH","4,001 to 10,000 Vehicles51 - 100",150,150,150,150,180,225,280]
[null,"4,001 to 10,000 Vehicles","101 - 200","15 MPH","4,001 to 10,000 Vehicles101 - 200",150,150,150,180,225,280,335]
[null,"4,001 to 10,000 Vehicles","201 - 300","10 MPH","4,001 to 10,000 Vehicles201 - 300",150,150,180,225,280,335,400]
[null,"4,001 to 10,000 Vehicles","301 - 400",null,"4,001 to 10,000 Vehicles301 - 400",150,150,180,225,280,335,400]
[null,"4,001 to 10,000 Vehicles","Over 400","5 MPH","4,001 to 10,000 VehiclesOver 400",150,155,225,280,335,400,470]
[null,"Over 10,000 Vehicles","0-50",null,{"$f":"B216&C216","v":"Over 10,000 Vehicles0-50"},"-","-","-","-","-","-","-"]
[null,"Over 10,000 Vehicles","51 - 100","15 MPH","Over 10,000 Vehicles51 - 100",150,150,150,180,225,280,335]
[null,"Over 10,000 Vehicles","101 - 200","10 MPH","Over 10,000 Vehicles101 - 200",150,150,180,225,280,335,400]
[null,"Over 10,000 Vehicles","201 - 300","5 MPH","Over 10,000 Vehicles201 - 300",150,155,225,280,335,400,470]
[null,"Over 10,000 Vehicles","301 - 400",null,"Over 10,000 Vehicles301 - 400",150,155,225,280,335,400,470]
[null,"Over 10,000 Vehicles","Over 400","0 MPH","Over 10,000 VehiclesOver 400",180,200,280,335,400,470,550]
[]
[]
[null,"Right-Turn Lane Warrants (R ≤ 50')   G = 8% Downgrade"]
[null,"Projected 10-Year     Roadway ADT","Right-turn ADT","Assumed Speed Change on Through Lane",null,"Highway Posted Speed"]
[]
[null,null,null,null,null,null,null,null,null,null,null,null,{"$f":"IF(D$4=-8,INDEX(E228:L252,MATCH(F$4,E228:E252,),MATCH(C$3,E228:L228,)),)","v":0}]
[null,null,null,null,null,25,30,35,40,45,50,55]
[null,"Less Than 2,000","0-50",null,{"$f":"B229&C229","v":"Less Than 2,0000-50"},"-","-","-","-","-","-","-"]
[null,"Less Than 2,000","51 - 100",null,{"$f":"B230&C230","v":"Less Than 2,00051 - 100"},"-","-","-","-","-","-","-"]
[null,"Less Than 2,000","101 - 200","20 MPH","Less Than 2,000101 - 200",100,100,105,150,185,230,285]
[null,"Less Than 2,000","201 - 300",null,"Less Than 2,000201 - 300",100,100,140,185,230,285,345]
[null,"Less Than 2,000","301 - 400",null,"Less Than 2,000301 - 400",100,100,140,185,230,285,345]
[null,"Less Than 2,000","Over 400","15 MPH","Less Than 2,000Over 400",100,100,140,185,230,285,345]
[null,"2,000 to 4,000 Vehicles","0-50",null,{"$f":"B235&C235","v":"2,000 to 4,000 Vehicles0-50"},"-","-","-","-","-","-","-"]
[null,"2,000 to 4,000 Vehicles","51 - 100",null,"2,000 to 4,000 Vehicles51 - 100","-","-","-","-","-","-","-"]
[null,"2,000 to 4,000 Vehicles","101 - 200","20 MPH","2,000 to 4,000 Vehicles101 - 200",100,100,105,150,185,230,285]
[null,"2,000 to 4,000 Vehicles","201 - 300",null,"2,000 to 4,000 Vehicles201 - 300",100,100,140,185,230,285,345]
[null,"2,000 to 4,000 Vehicles","301 - 400","15 MPH","2,000 to 4,000 Vehicles301 - 400",100,100,140,185,230,285,345]
[null,"2,000 to 4,000 Vehicles","Over 400","10 MPH","2,000 to 4,000 VehiclesOver 400",105,115,185,230,285,345,410]
[null,"4,001 to 10,000 Vehicles","0-50",null,{"$f":"B241&C241","v":"4,001 to 10,000 Vehicles0-50"},"-","-","-","-","-","-","-"]
[null,"4,001 to 10,000 Vehicles","51 - 100","20 MPH","4,001 to 10,000 Vehicles51 - 100",150,150,150,150,185,230,285]
[null,"4,001 to 10,000 Vehicles","101 - 200","15 MPH","4,001 to 10,000 Vehicles101 - 200",150,150,150,185,230,285,345]
[null,"4,001 to 10,000 Vehicles","201 - 300","10 MPH","4,001 to 10,000 Vehicles201 - 300",150,150,185,230,285,345,410]
[null,"4,001 to 10,000 Vehicles","301 - 400",null,"4,001 to 10,000 Vehicles301 - 400",150,150,185,230,285,345,410]
[null,"4,001 to 10,000 Vehicles","Over 400","5 MPH","4,001 to 10,000 VehiclesOver 400",150,155,230,285,345,410,485]
[null,"Over 10,000 Vehicles","0-50",null,{"$f":"B247&C247","v":"Over 10,000 Vehicles0-50"},"-","-","-","-","-","-","-"]
[null,"Over 10,000 Vehicles","51 - 100","15 MPH","Over 10,000 Vehicles51 - 100",150,150,150,185,230,285,345]
[null,"Over 10,000 Vehicles","101 - 200","10 MPH","Over 10,000 Vehicles101 - 200",150,150,185,230,285,345,410]
[null,"Over 10,000 Vehicles","201 - 300","5 MPH","Over 10,000 Vehicles201 - 300",150,155,230,285,345,410,485]
[null,"Over 10,000 Vehicles","301 - 400",null,"Over 10,000 Vehicles301 - 400",150,155,230,285,345,410,485]
[null,"Over 10,000 Vehicles","Over 400","0 MPH","Over 10,000 VehiclesOver 400",185,205,285,345,410,485,565]
[]
[]
[null,"Right-Turn Lane Warrants (R ≤ 50')  G = 9% Downgrade"]
[null,"Projected 10-Year     Roadway ADT","Right-turn ADT","Assumed Speed Change on Through Lane",null,"Highway Posted Speed"]
[]
[null,null,null,null,null,null,null,null,null,null,null,null,{"$f":"IF(D$4=-9,INDEX(E259:L283,MATCH(F$4,E259:E283,),MATCH(C$3,E259:L259,)),)","v":0}]
[null,null,null,null,null,25,30,35,40,45,50,55]
[null,"Less Than 2,000","0-50",null,{"$f":"B260&C260","v":"Less Than 2,0000-50"},"-","-","-","-","-","-","-"]
[null,"Less Than 2,000","51 - 100",null,{"$f":"B261&C261","v":"Less Than 2,00051 - 100"},"-","-","-","-","-","-","-"]
[null,"Less Than 2,000","101 - 200","20 MPH","Less Than 2,000101 - 200",100,100,110,150,190,235,295]
[null,"Less Than 2,000","201 - 300",null,"Less Than 2,000201 - 300",100,100,145,190,235,295,355]
[null,"Less Than 2,000","301 - 400",null,"Less Than 2,000301 - 400",100,100,145,190,235,295,355]
[null,"Less Than 2,000","Over 400","15 MPH","Less Than 2,000Over 400",100,100,145,190,235,295,355]
[null,"2,000 to 4,000 Vehicles","0-50",null,{"$f":"B266&C266","v":"2,000 to 4,000 Vehicles0-50"},"-","-","-","-","-","-","-"]
[null,"2,000 to 4,000 Vehicles","51 - 100",null,"2,000 to 4,000 Vehicles51 - 100","-","-","-","-","-","-","-"]
[null,"2,000 to 4,000 Vehicles","101 - 200","20 MPH","2,000 to 4,000 Vehicles101 - 200",100,100,110,150,190,235,295]
[null,"2,000 to 4,000 Vehicles","201 - 300",null,"2,000 to 4,000 Vehicles201 - 300",100,100,145,190,235,295,355]
[null,"2,000 to 4,000 Vehicles","301 - 400","15 MPH","2,000 to 4,000 Vehicles301 - 400",100,100,145,190,235,295,355]
[null,"2,000 to 4,000 Vehicles","Over 400","10 MPH","2,000 to 4,000 VehiclesOver 400",110,110,190,235,295,355,425]
[null,"4,001 to 10,000 Vehicles","0-50",null,{"$f":"B272&C272","v":"4,001 to 10,000 Vehicles0-50"},"-","-","-","-","-","-","-"]
[null,"4,001 to 10,000 Vehicles","51 - 100","20 MPH","4,001 to 10,000 Vehicles51 - 100",150,150,150,150,190,235,295]
[null,"4,001 to 10,000 Vehicles","101 - 200","15 MPH","4,001 to 10,000 Vehicles101 - 200",150,150,150,190,235,295,355]
[null,"4,001 to 10,000 Vehicles","201 - 300","10 MPH","4,001 to 10,000 Vehicles201 - 300",150,150,190,235,295,355,425]
[null,"4,001 to 10,000 Vehicles","301 - 400",null,"4,001 to 10,000 Vehicles301 - 400",150,150,190,235,295,355,425]
[null,"4,001 to 10,000 Vehicles","Over 400","5 MPH","4,001 to 10,000 VehiclesOver 400",150,150,235,295,355,425,500]
[null,"Over 10,000 Vehicles","0-50",null,{"$f":"B278&C278","v":"Over 10,000 Vehicles0-50"},"-","-","-","-","-","-","-"]
[null,"Over 10,000 Vehicles","51 - 100","15 MPH","Over 10,000 Vehicles51 - 100",150,150,150,190,235,295,355]
[null,"Over 10,000 Vehicles","101 - 200","10 MPH","Over 10,000 Vehicles101 - 200",150,150,190,235,295,355,425]
[null,"Over 10,000 Vehicles","201 - 300","5 MPH","Over 10,000 Vehicles201 - 300",150,150,235,295,355,425,500]
[null,"Over 10,000 Vehicles","301 - 400",null,"Over 10,000 Vehicles301 - 400",150,150,235,295,355,425,500]
[null,"Over 10,000 Vehicles","Over 400","0 MPH","Over 10,000 VehiclesOver 400",190,190,295,355,425,500,580]
[]
[]
[null,"Right-Turn Lane Warrants (R ≤ 50')  Level G = 0% "]
[null,"Projected 10-Year     Roadway ADT","Right-turn ADT","Assumed Speed Change on Through Lane",null,"Highway Posted Speed"]
[]
[null,null,null,null,null,null,null,null,null,null,null,null,{"$f":"IF(D$4=0,INDEX(E290:L314,MATCH(F$4,E290:E314,),MATCH(C$3,E290:L290,)),)","v":{"$error":"#N/A"}}]
[null,null,null,null,null,25,30,35,40,45,50,55]
[null,"Less Than 2,000","0-50",null,{"$f":"B291&C291","v":"Less Than 2,0000-50"},"-","-","-","-","-","-","-"]
[null,"Less Than 2,000","51 - 100",null,{"$f":"B292&C292","v":"Less Than 2,00051 - 100"},"-","-","-","-","-","-","-"]
[null,"Less Than 2,000","101 - 200","20 MPH","Less Than 2,000101 - 200",100,100,100,150,160,195,240]
[null,"Less Than 2,000","201 - 300",null,"Less Than 2,000201 - 300",100,100,125,160,195,240,290]
[null,"Less Than 2,000","301 - 400",null,"Less Than 2,000301 - 400",100,100,125,160,195,240,290]
[null,"Less Than 2,000","Over 400","15 MPH","Less Than 2,000Over 400",100,100,125,160,195,240,290]
[null,"2,000 to 4,000 Vehicles","0-50",null,{"$f":"B297&C297","v":"2,000 to 4,000 Vehicles0-50"},"-","-","-","-","-","-","-"]
[null,"2,000 to 4,000 Vehicles","51 - 100",null,"2,000 to 4,000 Vehicles51 - 100","-","-","-","-","-","-","-"]
[null,"2,000 to 4,000 Vehicles","101 - 200","20 MPH","2,000 to 4,000 Vehicles101 - 200",100,100,100,150,160,195,240]
[null,"2,000 to 4,000 Vehicles","201 - 300",null,"2,000 to 4,000 Vehicles201 - 300",100,100,125,160,195,240,290]
[null,"2,000 to 4,000 Vehicles","301 - 400","15 MPH","2,000 to 4,000 Vehicles301 - 400",100,100,125,160,195,240,290]
[null,"2,000 to 4,000 Vehicles","Over 400","10 MPH","2,000 to 4,000 VehiclesOver 400",100,120,160,195,240,290,340]
[null,"4,001 to 10,000 Vehicles","0-50",null,{"$f":"B303&C303","v":"4,001 to 10,000 Vehicles0-50"},"-","-","-","-","-","-","-"]
[null,"4,001 to 10,000 Vehicles","51 - 100","20 MPH","4,001 to 10,000 Vehicles51 - 100",150,150,150,150,160,195,240]
[null,"4,001 to 10,000 Vehicles","101 - 200","15 MPH","4,001 to 10,000 Vehicles101 - 200",150,150,150,160,195,240,290]
[null,"4,001 to 10,000 Vehicles","201 - 300","10 MPH","4,001 to 10,000 Vehicles201 - 300",150,150,160,195,240,290,340]
[null,"4,001 to 10,000 Vehicles","301 - 400",null,"4,001 to 10,000 Vehicles301 - 400",150,150,160,195,240,290,340]
[null,"4,001 to 10,000 Vehicles","Over 400","5 MPH","4,001 to 10,000 VehiclesOver 400",150,150,195,240,290,340,400]
[null,"Over 10,000 Vehicles","0-50",null,{"$f":"B309&C309","v":"Over 10,000 Vehicles0-50"},"-","-","-","-","-","-","-"]
[null,"Over 10,000 Vehicles","51 - 100","15 MPH","Over 10,000 Vehicles51 - 100",150,150,150,160,195,240,290]
[null,"Over 10,000 Vehicles","101 - 200","10 MPH","Over 10,000 Vehicles101 - 200",150,150,160,195,240,290,340]
[null,"Over 10,000 Vehicles","201 - 300","5 MPH","Over 10,000 Vehicles201 - 300",150,150,195,240,290,340,400]
[null,"Over 10,000 Vehicles","301 - 400",null,"Over 10,000 Vehicles301 - 400",150,150,195,240,290,340,400]
[null,"Over 10,000 Vehicles","Over 400","0 MPH","Over 10,000 VehiclesOver 400",160,175,240,290,340,400,460]
[]
[null,"Right-Turn Lane Warrants (R ≤ 50')  Level G = 1% "]
[null,"Projected 10-Year     Roadway ADT","Right-turn ADT","Assumed Speed Change on Through Lane",null,"Highway Posted Speed"]
[]
[null,null,null,null,null,null,null,null,null,null,null,null,{"$f":"IF(D$4=1,INDEX(E320:L344,MATCH(F$4,E320:E344,),MATCH(C$3,E320:L320,)),)","v":0}]
[null,null,null,null,null,25,30,35,40,45,50,55]
[null,"Less Than 2,000","0-50",null,{"$f":"B321&C321","v":"Less Than 2,0000-50"},"-","-","-","-","-","-","-"]
[null,"Less Than 2,000","51 - 100",null,{"$f":"B322&C322","v":"Less Than 2,00051 - 100"},"-","-","-","-","-","-","-"]
[null,"Less Than 2,000","101 - 200","20 MPH","Less Than 2,000101 - 200",100,100,100,150,160,195,240]
[null,"Less Than 2,000","201 - 300",null,"Less Than 2,000201 - 300",100,100,125,160,195,240,290]
[null,"Less Than 2,000","301 - 400",null,"Less Than 2,000301 - 400",100,100,125,160,195,240,290]
[null,"Less Than 2,000","Over 400","15 MPH","Less Than 2,000Over 400",100,100,125,160,195,240,290]
[null,"2,000 to 4,000 Vehicles","0-50",null,{"$f":"B327&C327","v":"2,000 to 4,000 Vehicles0-50"},"-","-","-","-","-","-","-"]
[null,"2,000 to 4,000 Vehicles","51 - 100",null,"2,000 to 4,000 Vehicles51 - 100","-","-","-","-","-","-","-"]
[null,"2,000 to 4,000 Vehicles","101 - 200","20 MPH","2,000 to 4,000 Vehicles101 - 200",100,100,100,150,160,195,240]
[null,"2,000 to 4,000 Vehicles","201 - 300",null,"2,000 to 4,000 Vehicles201 - 300",100,100,125,160,195,240,290]
[null,"2,000 to 4,000 Vehicles","301 - 400","15 MPH","2,000 to 4,000 Vehicles301 - 400",100,100,125,160,195,240,290]
[null,"2,000 to 4,000 Vehicles","Over 400","10 MPH","2,000 to 4,000 VehiclesOver 400",100,120,160,195,240,290,340]
[null,"4,001 to 10,000 Vehicles","0-50",null,{"$f":"B333&C333","v":"4,001 to 10,000 Vehicles0-50"},"-","-","-","-","-","-","-"]
[null,"4,001 to 10,000 Vehicles","51 - 100","20 MPH",{"$f":"B334&C334","v":"4,001 to 10,000 Vehicles51 - 100"},150,150,150,150,160,195,240]
[null,"4,001 to 10,000 Vehicles","101 - 200","15 MPH","4,001 to 10,000 Vehicles101 - 200",150,150,150,160,195,240,290]
[null,"4,001 to 10,000 Vehicles","201 - 300","10 MPH","4,001 to 10,000 Vehicles201 - 300",150,150,160,195,240,290,340]
[null,"4,001 to 10,000 Vehicles","301 - 400",null,"4,001 to 10,000 Vehicles301 - 400",150,150,160,195,240,290,340]
[null,"4,001 to 10,000 Vehicles","Over 400","5 MPH","4,001 to 10,000 VehiclesOver 400",150,150,195,240,290,340,400]
[null,"Over 10,000 Vehicles","0-50",null,{"$f":"B339&C339","v":"Over 10,000 Vehicles0-50"},"-","-","-","-","-","-","-"]
[null,"Over 10,000 Vehicles","51 - 100","15 MPH","Over 10,000 Vehicles51 - 100",150,150,150,160,195,240,290]
[null,"Over 10,000 Vehicles","101 - 200","10 MPH","Over 10,000 Vehicles101 - 200",150,150,160,195,240,290,340]
[null,"Over 10,000 Vehicles","201 - 300","5 MPH","Over 10,000 Vehicles201 - 300",150,150,195,240,290,340,400]
[null,"Over 10,000 Vehicles","301 - 400",null,"Over 10,000 Vehicles301 - 400",150,150,195,240,290,340,400]
[null,"Over 10,000 Vehicles","Over 400","0 MPH","Over 10,000 VehiclesOver 400",160,175,240,290,340,400,460]
[]
[null,"Right-Turn Lane Warrants (R ≤ 50')  Level G = 2% "]
[null,"Projected 10-Year     Roadway ADT","Right-turn ADT","Assumed Speed Change on Through Lane",null,"Highway Posted Speed"]
[]
[null,null,null,null,null,null,null,null,null,null,null,null,{"$f":"IF(D$4=2,INDEX(E350:L374,MATCH(F$4,E350:E374,),MATCH(C$3,E350:L350,)),)","v":0}]
[null,null,null,null,null,25,30,35,40,45,50,55]
[null,"Less Than 2,000","0-50",null,{"$f":"B351&C351","v":"Less Than 2,0000-50"},"-","-","-","-","-","-","-"]
[null,"Less Than 2,000","51 - 100",null,{"$f":"B352&C352","v":"Less Than 2,00051 - 100"},"-","-","-","-","-","-","-"]
[null,"Less Than 2,000","101 - 200","20 MPH","Less Than 2,000101 - 200",100,100,100,150,160,195,240]
[null,"Less Than 2,000","201 - 300",null,"Less Than 2,000201 - 300",100,100,125,160,195,240,290]
[null,"Less Than 2,000","301 - 400",null,"Less Than 2,000301 - 400",100,100,125,160,195,240,290]
[null,"Less Than 2,000","Over 400","15 MPH","Less Than 2,000Over 400",100,100,125,160,195,240,290]
[null,"2,000 to 4,000 Vehicles","0-50",null,{"$f":"B357&C357","v":"2,000 to 4,000 Vehicles0-50"},"-","-","-","-","-","-","-"]
[null,"2,000 to 4,000 Vehicles","51 - 100",null,"2,000 to 4,000 Vehicles51 - 100","-","-","-","-","-","-","-"]
[null,"2,000 to 4,000 Vehicles","101 - 200","20 MPH","2,000 to 4,000 Vehicles101 - 200",100,100,100,150,160,195,240]
[null,"2,000 to 4,000 Vehicles","201 - 300",null,"2,000 to 4,000 Vehicles201 - 300",100,100,125,160,195,240,290]
[null,"2,000 to 4,000 Vehicles","301 - 400","15 MPH","2,000 to 4,000 Vehicles301 - 400",100,100,125,160,195,240,290]
[null,"2,000 to 4,000 Vehicles","Over 400","10 MPH","2,000 to 4,000 VehiclesOver 400",100,120,160,195,240,290,340]
[null,"4,001 to 10,000 Vehicles","0-50",null,{"$f":"B363&C363","v":"4,001 to 10,000 Vehicles0-50"},"-","-","-","-","-","-","-"]
[null,"4,001 to 10,000 Vehicles","51 - 100","20 MPH","4,001 to 10,000 Vehicles51 - 100",150,150,150,150,160,195,240]
[null,"4,001 to 10,000 Vehicles","101 - 200","15 MPH","4,001 to 10,000 Vehicles101 - 200",150,150,150,160,195,240,290]
[null,"4,001 to 10,000 Vehicles","201 - 300","10 MPH","4,001 to 10,000 Vehicles201 - 300",150,150,160,195,240,290,340]
[null,"4,001 to 10,000 Vehicles","301 - 400",null,"4,001 to 10,000 Vehicles301 - 400",150,150,160,195,240,290,340]
[null,"4,001 to 10,000 Vehicles","Over 400","5 MPH","4,001 to 10,000 VehiclesOver 400",150,150,195,240,290,340,400]
[null,"Over 10,000 Vehicles","0-50",null,{"$f":"B369&C369","v":"Over 10,000 Vehicles0-50"},"-","-","-","-","-","-","-"]
[null,"Over 10,000 Vehicles","51 - 100","15 MPH","Over 10,000 Vehicles51 - 100",150,150,150,160,195,240,290]
[null,"Over 10,000 Vehicles","101 - 200","10 MPH","Over 10,000 Vehicles101 - 200",150,150,160,195,240,290,340]
[null,"Over 10,000 Vehicles","201 - 300",null,"Over 10,000 Vehicles201 - 300",150,150,195,240,290,340,400]
[null,"Over 10,000 Vehicles","301 - 400","5 MPH","Over 10,000 Vehicles301 - 400",150,150,195,240,290,340,400]
[null,"Over 10,000 Vehicles","Over 400","0 MPH","Over 10,000 VehiclesOver 400",160,175,240,290,340,400,460]
[]
[]
[null,"Right-Turn Lane Warrants (R ≤ 50')  G = 3% Upgrade"]
[null,"Projected 10-Year     Roadway ADT","Right-turn ADT","Assumed Speed Change on Through Lane",null,"Highway Posted Speed"]
[]
[null,null,null,null,null,null,null,null,null,null,null,null,{"$f":"IF(D$4=3,INDEX(E381:L405,MATCH(F$4,E381:E405,),MATCH(C$3,E381:L381,)),)","v":0}]
[null,null,null,null,null,25,30,35,40,45,50,55]
[null,"Less Than 2,000","0-50",null,{"$f":"B382&C382","v":"Less Than 2,0000-50"},"-","-","-","-","-","-","-"]
[null,"Less Than 2,000","51 - 100",null,{"$f":"B383&C383","v":"Less Than 2,00051 - 100"},"-","-","-","-","-","-","-"]
[null,"Less Than 2,000","101 - 200","20 MPH","Less Than 2,000101 - 200",100,100,100,150,150,185,225]
[null,"Less Than 2,000","201 - 300",null,"Less Than 2,000201 - 300",100,100,120,150,185,225,270]
[null,"Less Than 2,000","301 - 400",null,"Less Than 2,000301 - 400",100,100,120,150,185,225,270]
[null,"Less Than 2,000","Over 400","15 MPH","Less Than 2,000Over 400",100,100,120,150,185,225,270]
[null,"2,000 to 4,000 Vehicles","0-50",null,{"$f":"B388&C388","v":"2,000 to 4,000 Vehicles0-50"},"-","-","-","-","-","-","-"]
[null,"2,000 to 4,000 Vehicles","51 - 100",null,"2,000 to 4,000 Vehicles51 - 100","-","-","-","-","-","-","-"]
[null,"2,000 to 4,000 Vehicles","101 - 200","20 MPH","2,000 to 4,000 Vehicles101 - 200",100,100,100,150,150,185,225]
[null,"2,000 to 4,000 Vehicles","201 - 300",null,"2,000 to 4,000 Vehicles201 - 300",100,100,120,150,185,225,270]
[null,"2,000 to 4,000 Vehicles","301 - 400","15 MPH","2,000 to 4,000 Vehicles301 - 400",100,100,120,150,185,225,270]
[null,"2,000 to 4,000 Vehicles","Over 400","10 MPH","2,000 to 4,000 VehiclesOver 400",100,100,150,185,225,270,320]
[null,"4,001 to 10,000 Vehicles","0-50",null,{"$f":"B394&C394","v":"4,001 to 10,000 Vehicles0-50"},"-","-","-","-","-","-","-"]
[null,"4,001 to 10,000 Vehicles","51 - 100","20 MPH","4,001 to 10,000 Vehicles51 - 100",150,150,150,150,150,185,225]
[null,"4,001 to 10,000 Vehicles","101 - 200","15 MPH","4,001 to 10,000 Vehicles101 - 200",150,150,150,150,185,225,270]
[null,"4,001 to 10,000 Vehicles","201 - 300","10 MPH","4,001 to 10,000 Vehicles201 - 300",150,150,150,185,225,270,320]
[null,"4,001 to 10,000 Vehicles","301 - 400",null,"4,001 to 10,000 Vehicles301 - 400",150,150,150,185,225,270,320]
[null,"4,001 to 10,000 Vehicles","Over 400","5 MPH","4,001 to 10,000 VehiclesOver 400",150,185,185,225,270,320,375]
[null,"Over 10,000 Vehicles","0-50",null,{"$f":"B400&C400","v":"Over 10,000 Vehicles0-50"},"-","-","-","-","-","-","-"]
[null,"Over 10,000 Vehicles","51 - 100","15 MPH","Over 10,000 Vehicles51 - 100",150,150,150,150,185,225,270]
[null,"Over 10,000 Vehicles","101 - 200","10 MPH","Over 10,000 Vehicles101 - 200",150,150,150,185,225,270,320]
[null,"Over 10,000 Vehicles","201 - 300","5 MPH","Over 10,000 Vehicles201 - 300",150,185,185,225,270,320,375]
[null,"Over 10,000 Vehicles","301 - 400",null,"Over 10,000 Vehicles301 - 400",150,185,185,225,270,320,375]
[null,"Over 10,000 Vehicles","Over 400","0 MPH","Over 10,000 VehiclesOver 400",150,225,225,270,320,375,435]
[]
[]
[null,"Right-Turn Lane Warrants (R ≤ 50')  G = 4% Upgrade"]
[null,"Projected 10-Year     Roadway ADT","Right-turn ADT","Assumed Speed Change on Through Lane",null,"Highway Posted Speed"]
[]
[null,null,null,null,null,null,null,null,null,null,null,null,{"$f":"IF(D$4=4,INDEX(E412:L436,MATCH(F$4,E412:E436,),MATCH(C$3,E412:L412,)),)","v":0}]
[null,null,null,null,null,25,30,35,40,45,50,55]
[null,"Less Than 2,000","0-50",null,{"$f":"B413&C413","v":"Less Than 2,0000-50"},"-","-","-","-","-","-","-"]
[null,"Less Than 2,000","51 - 100",null,{"$f":"B414&C414","v":"Less Than 2,00051 - 100"},"-","-","-","-","-","-","-"]
[null,"Less Than 2,000","101 - 200","20 MPH","Less Than 2,000101 - 200",100,100,100,150,150,185,225]
[null,"Less Than 2,000","201 - 300",null,"Less Than 2,000201 - 300",100,100,120,150,185,225,270]
[null,"Less Than 2,000","301 - 400",null,"Less Than 2,000301 - 400",100,100,120,150,185,225,270]
[null,"Less Than 2,000","Over 400","15 MPH","Less Than 2,000Over 400",100,100,120,150,185,225,270]
[null,"2,000 to 4,000 Vehicles","0-50",null,{"$f":"B419&C419","v":"2,000 to 4,000 Vehicles0-50"},"-","-","-","-","-","-","-"]
[null,"2,000 to 4,000 Vehicles","51 - 100",null,"2,000 to 4,000 Vehicles51 - 100","-","-","-","-","-","-","-"]
[null,"2,000 to 4,000 Vehicles","101 - 200","20 MPH","2,000 to 4,000 Vehicles101 - 200",100,100,100,150,150,185,225]
[null,"2,000 to 4,000 Vehicles","201 - 300",null,"2,000 to 4,000 Vehicles201 - 300",100,100,120,150,185,225,270]
[null,"2,000 to 4,000 Vehicles","301 - 400","15 MPH","2,000 to 4,000 Vehicles301 - 400",100,100,120,150,185,225,270]
[null,"2,000 to 4,000 Vehicles","Over 400","10 MPH","2,000 to 4,000 VehiclesOver 400",100,100,150,185,225,270,315]
[null,"4,001 to 10,000 Vehicles","0-50",null,{"$f":"B425&C425","v":"4,001 to 10,000 Vehicles0-50"},"-","-","-","-","-","-","-"]
[null,"4,001 to 10,000 Vehicles","51 - 100","20 MPH","4,001 to 10,000 Vehicles51 - 100",150,150,150,150,150,185,225]
[null,"4,001 to 10,000 Vehicles","101 - 200","15 MPH","4,001 to 10,000 Vehicles101 - 200",150,150,150,150,185,225,270]
[null,"4,001 to 10,000 Vehicles","201 - 300","10 MPH","4,001 to 10,000 Vehicles201 - 300",150,150,150,185,225,270,315]
[null,"4,001 to 10,000 Vehicles","301 - 400",null,"4,001 to 10,000 Vehicles301 - 400",150,150,150,185,225,270,315]
[null,"4,001 to 10,000 Vehicles","Over 400","5 MPH","4,001 to 10,000 VehiclesOver 400",150,150,185,225,270,315,370]
[null,"Over 10,000 Vehicles","0-50",null,{"$f":"B431&C431","v":"Over 10,000 Vehicles0-50"},"-","-","-","-","-","-","-"]
[null,"Over 10,000 Vehicles","51 - 100","15 MPH","Over 10,000 Vehicles51 - 100",150,150,150,150,185,225,270]
[null,"Over 10,000 Vehicles","101 - 200","10 MPH","Over 10,000 Vehicles101 - 200",150,150,150,185,225,270,315]
[null,"Over 10,000 Vehicles","201 - 300","5 MPH","Over 10,000 Vehicles201 - 300",150,150,185,225,270,315,370]
[null,"Over 10,000 Vehicles","301 - 400",null,"Over 10,000 Vehicles301 - 400",150,150,185,225,270,315,370]
[null,"Over 10,000 Vehicles","Over 400","0 MPH","Over 10,000 VehiclesOver 400",150,165,225,270,315,370,425]
[]
[]
[null,"Right-Turn Lane Warrants (R ≤ 50')  G = 5% Upgrade"]
[null,"Projected 10-Year     Roadway ADT","Right-turn ADT","Assumed Speed Change on Through Lane",null,"Highway Posted Speed"]
[]
[null,null,null,null,null,null,null,null,null,null,null,null,{"$f":"IF(D$4=5,INDEX(E443:L467,MATCH(F$4,E443:E467,),MATCH(C$3,E443:L443,)),)","v":0}]
[null,null,null,null,null,25,30,35,40,45,50,55]
[null,"Less Than 2,000","0-50",null,{"$f":"B444&C444","v":"Less Than 2,0000-50"},"-","-","-","-","-","-","-"]
[null,"Less Than 2,000","51 - 100",null,{"$f":"B445&C445","v":"Less Than 2,00051 - 100"},"-","-","-","-","-","-","-"]
[null,"Less Than 2,000","101 - 200","20 MPH","Less Than 2,000101 - 200",100,100,100,150,150,180,220]
[null,"Less Than 2,000","201 - 300",null,"Less Than 2,000201 - 300",100,100,115,150,180,220,265]
[null,"Less Than 2,000","301 - 400",null,"Less Than 2,000301 - 400",100,100,115,150,180,220,265]
[null,"Less Than 2,000","Over 400","15 MPH","Less Than 2,000Over 400",100,100,115,150,180,220,265]
[null,"2,000 to 4,000 Vehicles","0-50",null,{"$f":"B450&C450","v":"2,000 to 4,000 Vehicles0-50"},"-","-","-","-","-","-","-"]
[null,"2,000 to 4,000 Vehicles","51 - 100",null,"2,000 to 4,000 Vehicles51 - 100","-","-","-","-","-","-","-"]
[null,"2,000 to 4,000 Vehicles","101 - 200","20 MPH","2,000 to 4,000 Vehicles101 - 200",100,100,100,150,150,180,220]
[null,"2,000 to 4,000 Vehicles","201 - 300",null,"2,000 to 4,000 Vehicles201 - 300",100,100,115,150,180,220,265]
[null,"2,000 to 4,000 Vehicles","301 - 400","15 MPH","2,000 to 4,000 Vehicles301 - 400",100,100,115,150,180,220,265]
[null,"2,000 to 4,000 Vehicles","Over 400","10 MPH","2,000 to 4,000 VehiclesOver 400",100,100,145,180,220,265,310]
[null,"4,001 to 10,000 Vehicles","0-50",null,{"$f":"B456&C456","v":"4,001 to 10,000 Vehicles0-50"},"-","-","-","-","-","-","-"]
[null,"4,001 to 10,000 Vehicles","51 - 100","20 MPH","4,001 to 10,000 Vehicles51 - 100",150,150,150,150,150,180,220]
[null,"4,001 to 10,000 Vehicles","101 - 200","15 MPH","4,001 to 10,000 Vehicles101 - 200",150,150,150,150,180,220,265]
[null,"4,001 to 10,000 Vehicles","201 - 300","10 MPH","4,001 to 10,000 Vehicles201 - 300",150,150,150,180,220,265,310]
[null,"4,001 to 10,000 Vehicles","301 - 400",null,"4,001 to 10,000 Vehicles301 - 400",150,150,150,180,220,265,310]
[null,"4,001 to 10,000 Vehicles","Over 400","5 MPH","4,001 to 10,000 VehiclesOver 400",150,150,180,220,265,310,360]
[null,"Over 10,000 Vehicles","0-50",null,{"$f":"B462&C462","v":"Over 10,000 Vehicles0-50"},"-","-","-","-","-","-","-"]
[null,"Over 10,000 Vehicles","51 - 100","15 MPH","Over 10,000 Vehicles51 - 100",150,150,150,150,180,220,265]
[null,"Over 10,000 Vehicles","101 - 200","10 MPH","Over 10,000 Vehicles101 - 200",150,150,150,180,220,265,310]
[null,"Over 10,000 Vehicles","201 - 300","5 MPH","Over 10,000 Vehicles201 - 300",150,150,180,220,265,310,360]
[null,"Over 10,000 Vehicles","301 - 400",null,"Over 10,000 Vehicles301 - 400",150,150,180,220,265,310,360]
[null,"Over 10,000 Vehicles","Over 400","0 MPH","Over 10,000 VehiclesOver 400",150,165,220,265,310,360,415]
[]
[]
[null,"Right-Turn Lane Warrants (R ≤ 50')  Level G = 6% Upgrade"]
[null,"Projected 10-Year     Roadway ADT","Right-turn ADT","Assumed Speed Change on Through Lane",null,"Highway Posted Speed"]
[]
[null,null,null,null,null,null,null,null,null,null,null,null,{"$f":"IF(D$4=6,INDEX(E474:L498,MATCH(F$4,E474:E498,),MATCH(C$3,E474:L474,)),)","v":0}]
[null,null,null,null,null,25,30,35,40,45,50,55]
[null,"Less Than 2,000","0-50",null,{"$f":"B475&C475","v":"Less Than 2,0000-50"},"-","-","-","-","-","-","-"]
[null,"Less Than 2,000","51 - 100",null,{"$f":"B476&C476","v":"Less Than 2,00051 - 100"},"-","-","-","-","-","-","-"]
[null,"Less Than 2,000","101 - 200","20 MPH","Less Than 2,000101 - 200",100,100,100,150,150,180,215]
[null,"Less Than 2,000","201 - 300",null,"Less Than 2,000201 - 300",100,100,115,150,180,215,260]
[null,"Less Than 2,000","301 - 400",null,"Less Than 2,000301 - 400",100,100,115,150,180,215,260]
[null,"Less Than 2,000","Over 400","15 MPH","Less Than 2,000Over 400",100,100,115,150,180,215,260]
[null,"2,000 to 4,000 Vehicles","0-50",null,{"$f":"B481&C481","v":"2,000 to 4,000 Vehicles0-50"},"-","-","-","-","-","-","-"]
[null,"2,000 to 4,000 Vehicles","51 - 100",null,"2,000 to 4,000 Vehicles51 - 100","-","-","-","-","-","-","-"]
[null,"2,000 to 4,000 Vehicles","101 - 200","20 MPH","2,000 to 4,000 Vehicles101 - 200",100,100,100,150,150,180,215]
[null,"2,000 to 4,000 Vehicles","201 - 300",null,"2,000 to 4,000 Vehicles201 - 300",100,100,115,150,180,215,260]
[null,"2,000 to 4,000 Vehicles","301 - 400","15 MPH","2,000 to 4,000 Vehicles301 - 400",100,100,115,150,180,215,260]
[null,"2,000 to 4,000 Vehicles","Over 400","10 MPH","2,000 to 4,000 VehiclesOver 400",100,100,145,180,215,260,305]
[null,"4,001 to 10,000 Vehicles","0-50",null,{"$f":"B487&C487","v":"4,001 to 10,000 Vehicles0-50"},"-","-","-","-","-","-","-"]
[null,"4,001 to 10,000 Vehicles","51 - 100","20 MPH","4,001 to 10,000 Vehicles51 - 100",150,150,150,150,150,180,215]
[null,"4,001 to 10,000 Vehicles","101 - 200","15 MPH","4,001 to 10,000 Vehicles101 - 200",150,150,150,150,180,215,260]
[null,"4,001 to 10,000 Vehicles","201 - 300","10 MPH","4,001 to 10,000 Vehicles201 - 300",150,150,150,180,215,260,305]
[null,"4,001 to 10,000 Vehicles","301 - 400",null,"4,001 to 10,000 Vehicles301 - 400",150,150,150,180,215,260,305]
[null,"4,001 to 10,000 Vehicles","Over 400","5 MPH","4,001 to 10,000 VehiclesOver 400",150,150,180,215,260,305,355]
[null,"Over 10,000 Vehicles","0-50",null,{"$f":"B493&C493","v":"Over 10,000 Vehicles0-50"},"-","-","-","-","-","-","-"]
[null,"Over 10,000 Vehicles","51 - 100","15 MPH","Over 10,000 Vehicles51 - 100",150,150,150,150,180,215,260]
[null,"Over 10,000 Vehicles","101 - 200","10 MPH","Over 10,000 Vehicles101 - 200",150,150,150,180,215,260,305]
[null,"Over 10,000 Vehicles","201 - 300","5 MPH","Over 10,000 Vehicles201 - 300",150,150,180,215,260,305,355]
[null,"Over 10,000 Vehicles","301 - 400",null,"Over 10,000 Vehicles301 - 400",150,150,180,215,260,305,355]
[null,"Over 10,000 Vehicles","Over 400","0 MPH","Over 10,000 VehiclesOver 400",150,160,215,260,305,355,410]
[]
[]
[null,"Right-Turn Lane Warrants (R ≤ 50')  G = 7% Upgrade"]
[null,"Projected 10-Year     Roadway ADT","Right-turn ADT","Assumed Speed Change on Through Lane",null,"Highway Posted Speed"]
[]
[null,null,null,null,null,null,null,null,null,null,null,null,{"$f":"IF(D$4=7,INDEX(E505:L529,MATCH(F$4,E505:E529,),MATCH(C$3,E505:L505,)),)","v":0}]
[null,null,null,null,null,25,30,35,40,45,50,55]
[null,"Less Than 2,000","0-50",null,{"$f":"B506&C506","v":"Less Than 2,0000-50"},"-","-","-","-","-","-","-"]
[null,"Less Than 2,000","51 - 100",null,{"$f":"B507&C507","v":"Less Than 2,00051 - 100"},"-","-","-","-","-","-","-"]
[null,"Less Than 2,000","101 - 200","20 MPH","Less Than 2,000101 - 200",100,100,100,150,150,175,215]
[null,"Less Than 2,000","201 - 300",null,"Less Than 2,000201 - 300",100,100,115,150,175,215,255]
[null,"Less Than 2,000","301 - 400",null,"Less Than 2,000301 - 400",100,100,115,150,175,215,255]
[null,"Less Than 2,000","Over 400","15 MPH","Less Than 2,000Over 400",100,100,115,150,175,215,255]
[null,"2,000 to 4,000 Vehicles","0-50",null,{"$f":"B512&C512","v":"2,000 to 4,000 Vehicles0-50"},"-","-","-","-","-","-","-"]
[null,"2,000 to 4,000 Vehicles","51 - 100",null,"2,000 to 4,000 Vehicles51 - 100","-","-","-","-","-","-","-"]
[null,"2,000 to 4,000 Vehicles","101 - 200","20 MPH","2,000 to 4,000 Vehicles101 - 200",100,100,100,150,150,175,215]
[null,"2,000 to 4,000 Vehicles","201 - 300",null,"2,000 to 4,000 Vehicles201 - 300",100,100,115,150,175,215,255]
[null,"2,000 to 4,000 Vehicles","301 - 400","15 MPH","2,000 to 4,000 Vehicles301 - 400",100,100,115,150,175,215,255]
[null,"2,000 to 4,000 Vehicles","Over 400","10 MPH","2,000 to 4,000 VehiclesOver 400",100,100,145,175,215,255,300]
[null,"4,001 to 10,000 Vehicles","0-50",null,{"$f":"B518&C518","v":"4,001 to 10,000 Vehicles0-50"},"-","-","-","-","-","-","-"]
[null,"4,001 to 10,000 Vehicles","51 - 100","20 MPH","4,001 to 10,000 Vehicles51 - 100",150,150,150,150,150,175,215]
[null,"4,001 to 10,000 Vehicles","101 - 200","15 MPH","4,001 to 10,000 Vehicles101 - 200",150,150,150,150,175,215,255]
[null,"4,001 to 10,000 Vehicles","201 - 300","10 MPH","4,001 to 10,000 Vehicles201 - 300",150,150,150,175,215,255,300]
[null,"4,001 to 10,000 Vehicles","301 - 400",null,"4,001 to 10,000 Vehicles301 - 400",150,150,150,175,215,255,300]
[null,"4,001 to 10,000 Vehicles","Over 400","5 MPH","4,001 to 10,000 VehiclesOver 400",150,150,175,215,255,300,350]
[null,"Over 10,000 Vehicles","0-50",null,{"$f":"B524&C524","v":"Over 10,000 Vehicles0-50"},"-","-","-","-","-","-","-"]
[null,"Over 10,000 Vehicles","51 - 100","15 MPH","Over 10,000 Vehicles51 - 100",150,150,150,150,175,215,255]
[null,"Over 10,000 Vehicles","101 - 200","10 MPH","Over 10,000 Vehicles101 - 200",150,150,150,175,215,255,300]
[null,"Over 10,000 Vehicles","201 - 300","5 MPH","Over 10,000 Vehicles201 - 300",150,150,175,215,255,300,350]
[null,"Over 10,000 Vehicles","301 - 400",null,"Over 10,000 Vehicles301 - 400",150,150,175,215,255,300,350]
[null,"Over 10,000 Vehicles","Over 400","0 MPH","Over 10,000 VehiclesOver 400",150,160,215,255,300,350,405]
[]
[]
[null,"Right-Turn Lane Warrants (R ≤ 50')  G = 8% Upgrade"]
[null,"Projected 10-Year     Roadway ADT","Right-turn ADT","Assumed Speed Change on Through Lane",null,"Highway Posted Speed"]
[]
[null,null,null,null,null,null,null,null,null,null,null,null,{"$f":"IF(D$4=8,INDEX(E536:L560,MATCH(F$4,E536:E560,),MATCH(C$3,E536:L536,)),)","v":0}]
[null,null,null,null,null,25,30,35,40,45,50,55]
[null,"Less Than 2,000","0-50",null,{"$f":"B537&C537","v":"Less Than 2,0000-50"},"-","-","-","-","-","-","-"]
[null,"Less Than 2,000","51 - 100",null,{"$f":"B538&C538","v":"Less Than 2,00051 - 100"},"-","-","-","-","-","-","-"]
[null,"Less Than 2,000","101 - 200","20 MPH","Less Than 2,000101 - 200",100,100,100,150,150,175,210]
[null,"Less Than 2,000","201 - 300",null,"Less Than 2,000201 - 300",100,100,115,150,175,210,250]
[null,"Less Than 2,000","301 - 400",null,"Less Than 2,000301 - 400",100,100,115,150,175,210,250]
[null,"Less Than 2,000","Over 400","15 MPH","Less Than 2,000Over 400",100,100,115,150,175,210,250]
[null,"2,000 to 4,000 Vehicles","0-50",null,{"$f":"B543&C543","v":"2,000 to 4,000 Vehicles0-50"},"-","-","-","-","-","-","-"]
[null,"2,000 to 4,000 Vehicles","51 - 100",null,"2,000 to 4,000 Vehicles51 - 100","-","-","-","-","-","-","-"]
[null,"2,000 to 4,000 Vehicles","101 - 200","20 MPH","2,000 to 4,000 Vehicles101 - 200",100,100,100,150,150,175,210]
[null,"2,000 to 4,000 Vehicles","201 - 300",null,"2,000 to 4,000 Vehicles201 - 300",100,100,115,150,175,210,250]
[null,"2,000 to 4,000 Vehicles","301 - 400","15 MPH","2,000 to 4,000 Vehicles301 - 400",100,100,115,150,175,210,250]
[null,"2,000 to 4,000 Vehicles","Over 400","10 MPH","2,000 to 4,000 VehiclesOver 400",100,100,140,175,210,250,295]
[null,"4,001 to 10,000 Vehicles","0-50",null,{"$f":"B549&C549","v":"4,001 to 10,000 Vehicles0-50"},"-","-","-","-","-","-","-"]
[null,"4,001 to 10,000 Vehicles","51 - 100","20 MPH","4,001 to 10,000 Vehicles51 - 100",150,150,150,150,150,175,210]
[null,"4,001 to 10,000 Vehicles","101 - 200","15 MPH","4,001 to 10,000 Vehicles101 - 200",150,150,150,150,175,210,250]
[null,"4,001 to 10,000 Vehicles","201 - 300","10 MPH","4,001 to 10,000 Vehicles201 - 300",150,150,150,175,210,250,295]
[null,"4,001 to 10,000 Vehicles","301 - 400",null,"4,001 to 10,000 Vehicles301 - 400",150,150,150,175,210,250,295]
[null,"4,001 to 10,000 Vehicles","Over 400","5 MPH","4,001 to 10,000 VehiclesOver 400",150,150,175,210,250,295,345]
[null,"Over 10,000 Vehicles","0-50",null,{"$f":"B555&C555","v":"Over 10,000 Vehicles0-50"},"-","-","-","-","-","-","-"]
[null,"Over 10,000 Vehicles","51 - 100","15 MPH","Over 10,000 Vehicles51 - 100",150,150,150,150,175,210,250]
[null,"Over 10,000 Vehicles","101 - 200","10 MPH","Over 10,000 Vehicles101 - 200",150,150,150,175,210,250,295]
[null,"Over 10,000 Vehicles","201 - 300","5 MPH","Over 10,000 Vehicles201 - 300",150,150,175,210,250,295,345]
[null,"Over 10,000 Vehicles","301 - 400",null,"Over 10,000 Vehicles301 - 400",150,150,175,210,250,295,345]
[null,"Over 10,000 Vehicles","Over 400","0 MPH","Over 10,000 VehiclesOver 400",150,155,210,250,295,345,395]
[]
[]
[null,"Right-Turn Lane Warrants (R ≤ 50')  G = 9% Upgrade"]
[null,"Projected 10-Year     Roadway ADT","Right-turn ADT","Assumed Speed Change on Through Lane",null,"Highway Posted Speed"]
[]
[null,null,null,null,null,null,null,null,null,null,null,null,{"$f":"IF(D$4=9,INDEX(E567:L591,MATCH(F$4,E567:E591,),MATCH(C$3,E567:L567,)),)","v":0}]
[null,null,null,null,null,25,30,35,40,45,50,55]
[null,"Less Than 2,000","0-50",null,{"$f":"B568&C568","v":"Less Than 2,0000-50"},"-","-","-","-","-","-","-"]
[null,"Less Than 2,000","51 - 100",null,{"$f":"B569&C569","v":"Less Than 2,00051 - 100"},"-","-","-","-","-","-","-"]
[null,"Less Than 2,000","101 - 200","20 MPH","Less Than 2,000101 - 200",100,100,100,150,150,170,210]
[null,"Less Than 2,000","201 - 300",null,"Less Than 2,000201 - 300",100,100,110,150,170,210,250]
[null,"Less Than 2,000","301 - 400",null,"Less Than 2,000301 - 400",100,100,110,150,170,210,250]
[null,"Less Than 2,000","Over 400","15 MPH","Less Than 2,000Over 400",100,100,110,150,170,210,250]
[null,"2,000 to 4,000 Vehicles","0-50",null,{"$f":"B574&C574","v":"2,000 to 4,000 Vehicles0-50"},"-","-","-","-","-","-","-"]
[null,"2,000 to 4,000 Vehicles","51 - 100",null,"2,000 to 4,000 Vehicles51 - 100","-","-","-","-","-","-","-"]
[null,"2,000 to 4,000 Vehicles","101 - 200","20 MPH","2,000 to 4,000 Vehicles101 - 200",100,100,100,150,150,170,210]
[null,"2,000 to 4,000 Vehicles","201 - 300",null,"2,000 to 4,000 Vehicles201 - 300",100,100,110,150,170,210,250]
[null,"2,000 to 4,000 Vehicles","301 - 400","15 MPH","2,000 to 4,000 Vehicles301 - 400",100,100,110,150,170,210,250]
[null,"2,000 to 4,000 Vehicles","Over 400","10 MPH","2,000 to 4,000 VehiclesOver 400",100,100,140,170,210,250,290]
[null,"4,001 to 10,000 Vehicles","0-50",null,{"$f":"B580&C580","v":"4,001 to 10,000 Vehicles0-50"},"-","-","-","-","-","-","-"]
[null,"4,001 to 10,000 Vehicles","51 - 100","20 MPH","4,001 to 10,000 Vehicles51 - 100",150,150,150,150,150,170,210]
[null,"4,001 to 10,000 Vehicles","101 - 200","15 MPH","4,001 to 10,000 Vehicles101 - 200",150,150,150,150,170,210,250]
[null,"4,001 to 10,000 Vehicles","201 - 300","10 MPH","4,001 to 10,000 Vehicles201 - 300",150,150,150,170,210,250,290]
[null,"4,001 to 10,000 Vehicles","301 - 400",null,"4,001 to 10,000 Vehicles301 - 400",150,150,150,170,210,250,290]
[null,"4,001 to 10,000 Vehicles","Over 400","5 MPH","4,001 to 10,000 VehiclesOver 400",150,150,170,210,250,290,340]
[null,"Over 10,000 Vehicles","0-50",null,{"$f":"B586&C586","v":"Over 10,000 Vehicles0-50"},"-","-","-","-","-","-","-"]
[null,"Over 10,000 Vehicles","51 - 100","15 MPH","Over 10,000 Vehicles51 - 100",150,150,150,150,170,210,250]
[null,"Over 10,000 Vehicles","101 - 200","10 MPH","Over 10,000 Vehicles101 - 200",150,150,150,170,210,250,290]
[null,"Over 10,000 Vehicles","201 - 300","5 MPH","Over 10,000 Vehicles201 - 300",150,150,170,210,250,290,340]
[null,"Over 10,000 Vehicles","301 - 400",null,"Over 10,000 Vehicles301 - 400",150,150,170,210,250,290,340]
[null,"Over 10,000 Vehicles","Over 400","0 MPH","Over 10,000 VehiclesOver 400",150,155,210,250,290,340,390]

{"sheet":"Left Turn Lane-Tab 3","index":7,"n_rows":39,"n_cols":14,"rows_kept":39,"cut":false,"hidden":false,"merged":[[31,0,32,1],[31,9,31,13],[31,2,31,8]]}
[]
[]
[]
[]
[]
[]
[]
[]
[]
[]
[]
[]
[]
[]
[]
[]
[]
[]
[]
[]
[]
[]
[]
[]
[]
[]
[]
[]
[]
[]
[]
["Deceleration Length (ft) = \nBrake Reaction (ft) + Braking on Level (ft)",null,"Posted Speed (mph)",null,null,null,null,null,null,"10 Year Opposing Volume: Peak Hour %"]
[null,null,25,30,35,40,45,50,55,"Traffic Pattern Group","K-Factor","D-Factor","KxD-Factor","Truck %"]
["Brake reaction distance",null,44.1,51.5,58.8,58.8,66.150000000000006,73.5,80.849999999999994,1,10.5,56.7,{"$f":"K34*L34/10000","v":5.9535000000000005E-2},6.3]
["Braking distance on level",null,86.4,117.6,117.6,117.6,153.6,194.4,240,2,10.9,56.3,6.1366999999999998E-2,0.9]
["Stopping Sight Distance",null,131,169,177,177,220,268,321,4,12.4,58.6,7.2663999999999992E-2,0.8]
[null,null,null,null,null,null,null,null,null,5,11.8,55.1,{"$f":"K37*L37/10000","v":6.5018000000000006E-2},1.9]
["\n",null,null,null,null,null,null,null,null,7,14.2,58.9,8.363799999999999E-2,1.7]
[null,null,null,null,null,null,null,null,null,8,10.3,53.8,5.5413999999999998E-2,1.1000000000000001]

{"sheet":"Bypass Lane-Tab 4","index":8,"n_rows":33,"n_cols":8,"rows_kept":33,"cut":false,"hidden":false,"merged":[[23,0,25,0],[22,0,22,1],[22,2,22,3],[22,4,22,5],[19,0,20,0],[19,3,20,3],[23,1,25,2],[19,1,20,1],[19,2,20,2],[1,0,1,7],[14,0,18,0],[2,0,9,0],[2,1,9,1],[2,2,3,7],[10,0,11,0],[10,1,11,1],[10,2,11,2],[12,0,13,0],[12,1,13,1],[12,2,13,2],[12,3,13,3],[12,4,13,4],[18,6,19,7],[12,7,17,7],[4,2,8,2],[32,1,32,2],[23,6,25,7],[26,6,26,7],[27,6,27,7],[28,6,28,7],[29,6,29,7],[30,6,30,7],[31,6,31,7],[32,6,32,7],[29,1,29,2],[30,1,30,2],[31,1,31,2],[26,1,26,2],[27,1,27,2],[28,1,28,2],[23,5,25,5],[4,3,8,3],[4,4,8,4],[4,5,8,5],[4,6,8,6],[4,7,8,7],[9,2,9,7],[10,5,11,5],[10,6,11,6],[10,7,11,7],[12,5,13,5],[12,6,13,6],[10,3,11,3],[10,4,11,4]]}
[]
["Figure 5.2.9.2-a Bypass Lane Warrants"]
["Projected 10-year Roadway AADT","Projected 10-\nYear \nOpposing \nVolume (vph)","Left-Turning Vehicles (vph)"]
[]
[null,null,"Less than 10","10-14","15-20","21-30","31-40","Over 40"]
[]
[]
[]
[]
[null,null,"Storage Length (feet)"]
["Less than 1,500 Vehicles","Over 100","-","-","-",50,50,50]
[]
["1,500 to 2000 Vehicles","0-400","-","-",50,50,50]
[]
["2,001 to 4,000 Vehicles","0 - 100","-",50,50,50,50]
[null,"101 - 200","-",50,50,50,50]
[null,"201 - 300","-",50,50,50]
[null,"301 – 400","-",50,50,50]
[null,"Over 400","-",75,75,null,"See Left-Turn Lane Warrants"]
["4,001 to 8,000 Vehicles","-","-",75]
[]
["Over 8,000 Vehicles","-","-"]
[]
["Posted Speed (mph)","Approach Taper Length (feet)",null,null,null,"Posted Speed (mph)","Departure Taper Length (feet)"]
[]
[]
[25,"Bypass Lane Not Warranted",null,null,null,25,"Bypass Lane Not Warranted"]
[30,125,null,null,null,30,65]
[35,155,null,null,null,35,80]
[40,155,null,null,null,40,80]
[45,180,null,null,null,45,90]
[50,215,null,null,null,50,110]
[55,250,null,null,null,55,125]

{"sheet":"Right Turn Lane R ≤ 50-Tab 5","index":9,"n_rows":26,"n_cols":9,"rows_kept":26,"cut":false,"hidden":false,"merged":[[2,0,2,8],[7,0,9,0],[25,0,39,8],[10,0,13,0],[14,0,18,0],[19,0,23,0],[4,0,6,0],[4,1,6,1],[4,2,6,2],[4,3,4,8],[6,3,6,8]]}
[]
[]
["Figure 5.2.9.1-a Right Turn Lane Warrants (R<50’)"]
[]
["Projected 10-Year Roadway ADT","Right-turn ADT","Assumed Speed\nChange on\nThrough Lane","Highway Posted Speed"]
[null,null,null,"25 MPH","35 MPH","40 MPH","45 MPH","50 MPH","55 MPH"]
[null,null,null,"Deceleration Length"]
["Less Than 2,000\nVehicles","0-100","-","-","-","-","-","-","-"]
[null,"101 - 200","20 MPH",100,100,150,160,195,240]
[null,"Over 200","15 MPH",100,125,160,195,240,290]
["2,000 to 4,000\nVehicles","0-100","-","-","-","-","-","-","-"]
[null,"101 - 200","20 MPH",100,100,150,160,195,240]
[null,"201 - 400","15 MPH",100,125,160,195,240,290]
[null,"Over 400","10 MPH",100,160,195,240,290,340]
["4,001 to 10,000\nVehicles\n","0-50","-","-","-","-","-","-","-"]
[null,"51 - 100","20 MPH",150,150,150,160,195,240]
[null,"101 - 200","15 MPH",150,150,160,195,240,290]
[null,"201 - 400","10 MPH",150,160,195,240,290,340]
[null,"Over 400","5 MPH",150,195,240,290,340,400]
["Over 10,000\nVehicles\n","0-50","-","-","-","-","-","-","-"]
[null,"51 - 100","15 MPH",150,150,160,195,240,290]
[null,"101 - 200","10 MPH",150,160,195,240,290,340]
[null,"201 - 400","5 MPH",150,195,240,290,340,400]
[null,"Over 400","0 MPH",160,240,290,340,400,460]
[]
["Assumptions\n1. Vehicle Length (ft): 25\n2. Brake Reaction time, t (sec): 1\n3. Full deceleration to 0 mph (stop condition)\n4. Stopping Sight Distance determined, using methodology adopted from the AASHTO Green Book, as follows:\n a. Per Eq. 3-1, Braking distance on level, d1 = 1.075*((Vdesign speed)2/a), a = 11.2 ft/s2\n b. Per Eq. 3-2, Brake reaction distance, d2 = 1.47*(Vdesign speed)*t\n c. Per Eq. 3-3, Brake distance on grade, d3 = (Vdesign speed)2/(30*(a/32.2)±G), a = 11.2 ft/s2; G = percent of grade divided by 100\n d. AASHTO equations reference design speed which DelDOT defines as posted speed + 5 mph.\n5. A practical minimum storage length of 25 feet (1 vehicle) is included in the deceleration length as per the NCHRP 457,\npage 24.\n6. All right turn deceleration lengths include a 50-foot taper length"]

{"sheet":"Right Turn Lane R > 50-Tab 6","index":10,"n_rows":26,"n_cols":9,"rows_kept":26,"cut":false,"hidden":false,"merged":[[7,0,9,0],[10,0,13,0],[14,0,18,0],[19,0,23,0],[25,0,39,9],[2,0,2,8],[4,0,6,0],[4,1,6,1],[4,2,6,2],[4,3,4,8],[6,3,6,8]]}
[]
[]
["Figure 5.2.9.1-b Right Turn Lane Warrants (R>50’)"]
[]
["Projected 10-Year Roadway ADT","Right-turn ADT","Assumed Speed\nChange on\nThrough Lane","Highway Posted Speed"]
[null,null,null,"25 MPH","35 MPH","40 MPH","45 MPH","50 MPH","55 MPH"]
[null,null,null,"Deceleration Length"]
["Less Than 2,000\nVehicles","0-100","-","-","-","-","-","-","-"]
[null,"101 - 200","20 MPH","-",100,135,135,150,195]
[null,"Over 200","15 MPH","-",100,135,150,195,240]
["2,000 to 4,000\nVehicles","0-100","-","-","-","-","-","-","-"]
[null,"101 - 200","20 MPH","-",100,135,135,150,195]
[null,"201 - 400","15 MPH","-",100,135,150,195,240]
[null,"Over 400","10 MPH",100,110,150,195,240,295]
["4,001 to 10,000\nVehicles\n","0-50","-","-","-","-","-","-","-"]
[null,"51 - 100","20 MPH","-",135,135,135,150,195]
[null,"101 - 200","15 MPH","-",135,135,150,195,240]
[null,"201 - 400","10 MPH",135,135,150,195,240,295]
[null,"Over 400","5 MPH",135,150,195,240,295,355]
["Over 10,000\nVehicles\n","0-50","-","-","-","-","-","-","-"]
[null,"51 - 100","15 MPH","-",135,135,150,195,240]
[null,"101 - 200","10 MPH",135,135,150,195,240,295]
[null,"201 - 400","5 MPH",135,150,195,240,295,355]
[null,"Over 400","0 MPH",135,195,240,295,355,415]
[]
["Assumptions\n1. Vehicle Length (ft): 25\n2. Brake Reaction time, t (sec): 1\n3. Deceleration to 15 mph (turning design speed of a corner radius > 50 feet adopted from the DelDOT Road Design Manual)\n4. Stopping Sight Distance determined by adding the Brake Reaction Distance, (adopted from AASHTO Green Book) and the\nBraking Distance on Level from the Uniform Acceleration Formula (UAF) as follows:\n a. Per Eq. 3-2, adopted from the AASHTO Green Book, Brake reaction distance, d1 = 1.47*(Vdesign speed)*t\n b. Per UAF, Braking distance on level from Design Speed to 15 mph, d2 = ((1.47*15 mph)2- (1.47*Vdesign speed)2)/2a, a = -11.2 ft/s2\n c. Per UAF, Braking distance on grade from Design Speed to 15 mph, d2 = ((1.47*15 mph)2- (1.47*Vdesign speed)2)/2*(-32.2*(0.35±G));\nG = percent of grade divided by 100\n d. Equations reference design speed which DelDOT defines as posted speed + 5 mph.\n5. A practical minimum storage length of 25 feet (1 vehicle) is included in the deceleration length as per the NCHRP 457, page 24.\n6. All right turn deceleration lengths include a 50-foot taper length\n"]

{"sheet":"Signalized Intersection-Tab 7","index":11,"n_rows":63,"n_cols":9,"rows_kept":63,"cut":false,"hidden":false,"merged":[[43,0,43,1],[43,2,43,4],[43,7,43,8],[44,0,44,1],[44,2,44,4],[44,7,44,8],[48,0,48,8],[50,0,50,8],[45,0,45,1],[45,2,45,4],[45,6,46,7],[45,8,46,8],[40,0,40,8],[18,2,18,4],[14,1,14,2],[12,7,12,8],[15,0,15,8],[16,0,17,4],[16,6,16,8],[17,7,17,8],[18,0,18,1],[31,0,31,8],[27,0,27,1],[23,0,23,8],[0,0,0,8],[1,0,1,8],[5,0,7,3],[8,0,8,2],[9,0,9,2],[3,1,3,7],[5,6,6,6],[5,7,6,8],[7,7,7,8],[8,7,8,8],[9,7,9,8],[58,0,58,2],[52,0,52,8],[27,2,27,4],[27,7,27,8],[28,0,28,1],[28,2,28,4],[28,6,29,7],[28,8,29,8],[42,7,42,8],[36,6,37,6],[41,0,42,4],[41,6,41,8],[36,0,38,3],[39,7,39,8],[36,7,37,8],[38,7,38,8],[59,0,59,2],[60,0,60,2],[62,0,62,8],[19,0,19,1],[54,0,54,8],[56,0,57,2],[56,3,56,8],[24,0,25,4],[24,6,24,8],[25,7,25,8],[26,0,26,1],[26,2,26,4],[26,7,26,8],[34,0,34,8],[19,2,19,4],[19,7,19,8],[10,7,10,8],[11,7,11,8],[18,7,18,8],[20,0,20,1],[20,2,20,4],[20,6,21,7],[20,8,21,8]]}
[]
["LEFT-TURN LANE LENGTH AT SIGNALIZED INTERSECTIONS"]
[]
[null,"Requires more detailed coordination with the Traffic Impact Studies Group within the DelDOT: Development Coordination Section"]
[]
["From the Highway Capacity Manual 2010 (HCM 2010) / Highway Capacity Software 2010 (HCS 2010) determine the Left-Turn 95% QUEUE (Veh) and the Left-Turn 50% QUEUE (Veh)",null,null,null,null,null,"Posted Speed (mph)","DECELERATION  (Feet)*"]
[]
[null,null,null,null,null,null,25,135]
[null,null,null,null,null,null,35,180]
[null,null,null,null,null,null,40,180]
[null,null,null,null,null,null,45,220]
[null,null,null,null,null,null,50,270]
[null,null,null,null,null,null,55,325]
[null,null,null,null,null,null,"* Includes a 100-foot taper length"]
[]
["LEFT-TURN LANE LENGTH (Feet) = HCS 95% QUEUE + 100 Feet"]
["Input Data",null,null,null,null,null,"Sample"]
[null,null,null,null,null,null,"Input Data","Length "]
["HCS 2010 ",null,"95% Queue in veh",null,null,null,7.58,"7.58 x 25 = 189.5"]
["Taper",null,"100 Feet",null,null,null,null,100]
[null,null,null,null,null,null,"Total Left-Turn Lane Length (feet) ",null,290]
[]
[]
["LEFT-TURN LANE LENGTH (Feet) = HCS 50% QUEUE + DECELERATION"]
["Input Data",null,null,null,null,null,"Sample"]
[null,null,null,null,null,null,"Input Data","Length "]
["HCS 2010 ",null,"50% Queue in veh",null,null,null,3.18,"3.18 x 25 = 79.5"]
["Deceleration",null,"Posted Speed in mph",null,null,null,45,220]
[null,null,null,null,null,null,"Total Left-Turn Lane Length (feet) ",null,300]
[]
[]
["THE RECOMMENDED LEFT-TURN LANE LENGTH IS THE HIGHEST OF THE TWO VALUES = 300 feet"]
[]
[]
["RIGHT-TURN LANE LENGTH AT SIGNALIZED INTERSECTIONS"]
[]
["From the Highway Capacity Manual 2010 (HCM 2010) / Highway Capacity Software 2010 (HCS 2010) determine the Right-Turn 95% QUEUE (Veh)"]
[]
[]
[]
["RIGHT-TURN LANE LENGTH (Feet) = HCS 95% QUEUE + 50 Feet"]
["Input Data",null,null,null,null,null,"Sample"]
[null,null,null,null,null,null,"Input Data","Length "]
["HCS 2010 ",null,"95% Queue in veh",null,null,null,4.59,"4.59 x 25 = 114.8"]
["Taper",null,"50 Feet",null,null,null,null,50]
[null,null,null,null,null,null,"Total Right-Turn Lane Length (feet) ",null,165]
[]
[]
["RIGHT-TURN LANE LENGTH VALUE FROM THE UNSIGNALIZED INTERSECTION \"RIGHT TURN LANE R ≤ 50 MPH\" TAB 4"]
[]
["THE RECOMMENDED RIGHT-TURN LANE LENGTH IS THE HIGHEST OF THE TWO VALUES "]
[]
["Notes\n1. These tables and recommendations are for signalized intersections auxiliary lane calculations only.  For unsignalized intersections use Tabs 1 to 5."]
[]
["Assumptions\n1. Vehicle Length (ft): 25\n2. Brake Reaction time, t (sec): 1\n3. Deceleration length includes 100' opening taper to left turn lane\n4. Full deceleration to 0 mph (stop condition)\n5. Braking reaction distance assumes the following speed reduction from posted speed limit in through lane:\n  a. 0 mph for 25 - 35 mph posted speed\n  b. 5 mph for 40 - 55 mph posted speed\n6. Braking distance assumes the following speed reduction from posted speed limit in through lane:\n  a. 0 mph for 25 mph posted speed\n  b. 5 mph for 35 mph posted speed\n  c. 10 mph for 40 -55 mph posted speed\n7. Lengths determined using AASHTO Green Book as follows:\n  a. Per Eq. 3-2, Brake reaction distance, d = 1.47*Vdesign speed*t\n  b. Per Eq. 3-1, Braking distance on level, d = 1.075*((Vdesign speed)2/a), a = 11.2 ft/s  (-3% < Grade < 3%)\n  c. Per Eq. 3-3, Braking distance on grade, d = [(Vdesign speed)2/(30*(a/32.2)±G)], a = 11.2 ft/s, -3% ≥ G ≥ 3%\n  d. AASHTO equation and exhibit references design speed which DelDOT defines as posted speed + 5 mph."]
[]
["Deceleration Length (feet) = \nBrake Reaction + Braking on Level",null,null,"Posted Speed (mph)"]
[null,null,null,25,35,40,45,50,55]
["Brake reaction distance (ft)",null,null,44.1,58.8,58.8,66.150000000000006,73.5,80.849999999999994]
["Braking distance on level (ft)",null,null,86.4,117.6,117.6,153.6,194.4,240]
["Stopping Sight Distance (ft)",null,null,131,177,177,220,268,321]
[]
["2. Recommended Total Turn Lane Lengths are rounded up to the nearest 5'.\n"]

{"sheet":"Drop Lists - K&D factors - Msgs","index":12,"n_rows":28,"n_cols":22,"rows_kept":28,"cut":false,"hidden":true,"merged":[[0,10,0,13],[15,10,17,13],[0,1,1,7]]}
[null,"Drop lists ",null,null,null,null,null,null,null,null,"Critical Headway, tc"]
[null,null,null,null,null,null,null,null,null,null,null,"2 lanes","4 lanes","> 4 Lanes"]
[null,"Posted Speed","Roadway ADT","RT ADT","Funct Class","Intersection Legs","Radius","Proposed entrance ",null,null,"%HV",null,null,null,null,null,null,null,"0-50"]
[null,null,null,null,null,null,null,null,null,null,null,null,null,null,null,null,null,null,"51 - 100",null,null,{"$f":"'Traffic Generation Input Tab-1'!I22","v":0}]
[null,25,"Less Than 2,000","0-50","Interstate",3,"R≤50'","Proposed Entrance 1",null,null,5,{"$f":"(4.1+(1*K5/100))","v":4.1499999999999995},{"$f":"(4.1+(2*K5/100))","v":4.1999999999999993},null,null,null,null,null,"101 - 200"]
[null,30,"2,000 to 4,000 Vehicles","51 - 100","Other Freeway / Expressway",4,"R>50'","Proposed Entrance 2",null,null,10,4.1999999999999993,4.3,null,null,null,null,null,"201 - 300"]
[null,35,"4,001 to 10,000 Vehicles","101 - 200","Other Principal Arterial",null,null,"Existing Leg",null,null,20,4.3,4.5,null,null,null,null,null,"301 - 400"]
[null,40,"Over 10,000 Vehicles","201 - 300","Minor Arterial",null,null,null,null,null,30,4.3999999999999995,4.6999999999999993,null,null,null,null,null,"Over 400"]
[null,45,null,"301 - 400","Major Collector",null,null,null,null,null,40,4.5,4.8999999999999995]
[null,50,null,"Over 400","Minor Collector",null,null,null,null,null,50,4.5999999999999996,5.0999999999999996,null,null,null,null,null,{"$f":"IF(AND('Drop Lists - K&D factors - Msgs'!V4>=0,'Drop Lists - K&D factors - Msgs'!V4<=50),\"0-50\",IF(AND('Drop Lists - K&D factors - Msgs'!V4>50,'Drop Lists - K&D factors - Msgs'!V4<=100),\"51 - 100\",IF(AND('Drop Lists - K&D factors - Msgs'!V4>100,'Drop Lists - K&D factors - Msgs'!V4<=200),\"101 - 200\",IF(AND('Drop Lists - K&D factors - Msgs'!V4>200,'Drop Lists - K&D factors - Msgs'!V4<=300),\"201 - 300\",IF(AND('Drop Lists - K&D factors - Msgs'!V4>300,'Drop Lists - K&D factors - Msgs'!V4<=400),\"301 - 400\",\"Over 400\")))))","v":"0-50"}]
[null,55,null,null,"Local",null,null,null,null,null,70,4.8,5.5]
[]
[]
[]
[null,null,"Traffic Pattern Group",null,null,null,"10-Year"]
[null,"AADT",null,"K-Factor","D-Factor","Growth","Opposing",null,null,null,"Error Message Desplay \nTo disable it: Cut K18 cell and paste it to L18 cell or any other cell"]
[]
[]
[null,null,null,null,null,"Factor","Volume",null,null,null,{"$f":"IF('Aux Lane Inputs-Tab 2'!E6=\"\",\"Select if Signalized / Unsignalized\",IF('Aux Lane Inputs-Tab 2'!K6=\"\",\"Select the posted speed limit\",IF('Aux Lane Inputs-Tab 2'!E7=\"\",\"Input Roadway ADT\",IF('Aux Lane Inputs-Tab 2'!K7=\"\",\"Select Traffic Pattern Group\",IF('Aux Lane Inputs-Tab 2'!E9=\"\",\"Select the total number of through Lanes\",IF('Aux Lane Inputs-Tab 2'!K9=\"\",\"Select the number of intersection legs\",IF('Aux Lane Inputs-Tab 2'!E10=\"\",\"Select the Roadway Functional Classification\",IF('Aux Lane Inputs-Tab 2'!E14=\"\",\"Select Left Turn ADT\",IF('Aux Lane Inputs-Tab 2'!F15=\"\",\"Input Left Turn Lane VPH\",IF('Aux Lane Inputs-Tab 2'!E16=\"\",\"Select Approach grade\",IF(ABS('Aux Lane Inputs-Tab 2'!E16*100)>9,\"Approach Grade Excessive\",IF('Aux Lane Inputs-Tab 2'!E17=\"\",\"Select Heavy Vehicle %\",\"\"))))))))))))","v":"Select if Signalized / Unsignalized"},{"$f":"IF('Aux Lane Inputs-Tab 2'!E6=\"\",\"Select if Signalized / Unsignalized\",IF('Aux Lane Inputs-Tab 2'!E9=\"\",\"Select the total number of through Lanes\",IF('Aux Lane Inputs-Tab 2'!E10=\"\",\"Select the Roadway Functional Classification\",IF('Aux Lane Inputs-Tab 2'!K9=\"\",\"Select the number of intersection legs\",IF('Aux Lane Inputs-Tab 2'!K6=\"\",\"Select the posted speed limit\",IF('Aux Lane Inputs-Tab 2'!E7=\"\",\"Input Roadway ADT\",IF('Aux Lane Inputs-Tab 2'!K7=\"\",\"Select Traffic Pattern Group\",IF('Aux Lane Inputs-Tab 2'!E14=\"\",\"Select Left Turn ADT\",IF('Aux Lane Inputs-Tab 2'!F15=\"\",\"Input Left Turn Lane VPH\",IF('Aux Lane Inputs-Tab 2'!E16=\"\",\"Select Approach grade\",IF(ABS('Aux Lane Inputs-Tab 2'!E16*100)>9,\"Approach Grade Excessive\",IF('Aux Lane Inputs-Tab 2'!E17=\"\",\"Select Heavy Vehicle %\",\"\"))))))))))))","v":"Select if Signalized / Unsignalized"}]
[]
[null,{"$f":"'Aux Lane Inputs-Tab 2'!E7","v":0},1,10.5,56.7,1.1599999999999999,{"$f":"(D21/100)*(E21/100)*F21*B21","v":0}]
[null,null,2,10.9,56.3,1.1599999999999999,{"$f":"(D22/100)*(E22/100)*F22*B21","v":0}]
[null,null,4,12.4,58.6,1.1599999999999999,{"$f":"(D23/100)*(E23/100)*F23*B21","v":0}]
[null,null,5,11.8,55.1,1.1599999999999999,{"$f":"(D24/100)*(E24/100)*F24*B21","v":0}]
[null,null,7,14.2,58.9,1.1599999999999999,{"$f":"(D25/100)*(E25/100)*F25*B21","v":0}]
[null,null,8,10.3,53.8,1.1599999999999999,{"$f":"(D26/100)*(E26/100)*F26*B21","v":0}]
[]
[null,"Updated per 2022 numbers on 4/28/23"]