{"text_format":"1","workbook":"xlsx","n_sheets":13,"sheets":["Traffic Generation Input Tab-1","Aux Lane Inputs-Tab 2","Left - Right Approach Example","By Pass Lane","L+Calcs","R>50+Calcs","R ≤ 50+Calcs","Left Turn Lane-Tab 3","Bypass Lane-Tab 4","Right Turn Lane R ≤ 50-Tab 5","Right Turn Lane R > 50-Tab 6","Signalized Intersection-Tab 7","Drop Lists - K&D factors - Msgs"],"not_rendered":{"charts":0,"images":7,"macros":1,"external_links":0,"defined_names":11,"comments":2,"pivot_tables":0},"unopened":[],"bounds":{"document_bytes":16777216,"sheet_cells":100000,"rows_first":2000,"rows_last":500,"rows_between":2000,"halvings":0,"cell_chars":16384,"cell_head_chars":4096},"cells_cut":0,"cells_raw":0,"read":"whole","date_system":"1900"}

{"sheet":"Traffic Generation Input Tab-1","index":0,"n_rows":37,"n_cols":23,"rows_kept":37,"cut":false,"hidden":false,"merged":[[4,12,5,12],[4,13,5,13],[6,10,8,10],[6,11,8,11],[6,12,8,12],[6,13,8,13],[4,11,5,11],[32,4,33,6],[32,7,33,8],[8,5,10,5],[8,6,10,6],[8,7,10,7],[30,7,31,8],[30,4,31,6],[21,8,22,8],[25,8,26,8],[46,1,55,11],[36,1,45,11],[21,10,22,10],[21,9,22,9],[4,10,5,10],[2,7,5,7],[2,5,5,5],[6,7,7,7],[6,5,7,5],[2,6,5,6],[6,6,7,6],[21,2,22,2],[24,6,26,6],[25,7,26,7],[21,3,22,3],[21,4,22,4]]}
["2023-04-28"]
[null,null,null,null,null,null,null,null,null,null,null,null,null,null,null,null,null,null,null,null,"No","AM / Sat",{"$f":"D22","v":0}]
[null,null,null,null,null,null,null,"[PM Peak]",null,null,null,null,null,null,null,null,null,null,null,null,"Yes","PM",{"$f":"C22","v":0}]
[null,null,null,null,null,null,null,null,null,null,null,null,null,null,null,null,null,{"$f":"IF(L5=\"No\",\"Macro 4\",\"Macro 5\")","v":"Macro 4"}]
[null,null,null,null,null,null,null,null,null,null,"RTL Channelized","No","% Reduction if Channalized",1]
[]
{"$rows_left_out":32}
{"sheet":"Aux Lane Inputs-Tab 2","index":1,"n_rows":26,"n_cols":47,"rows_kept":26,"cut":false,"hidden":false,"merged":[[8,10,8,11],[4,6,4,9],[5,6,5,9],[6,6,6,9],[8,6,8,9],[21,0,21,3],[22,0,22,3],[9,6,9,9],[10,6,10,9],[11,6,11,9],[15,6,15,9],[16,6,16,9],[18,6,18,9],[11,0,11,3],[10,0,10,3],[19,0,19,3],[20,0,20,3],[21,4,21,5],[22,4,22,5],[17,4,17,5],[0,0,0,1],[15,0,15,3],[16,0,16,3],[18,0,18,3],[13,42,13,43],[2,30,2,34],[3,30,3,34],[4,30,4,34],[5,30,5,34],[6,30,6,34],[7,30,7,34],[8,30,8,34],[9,30,9,34],[10,30,10,34],[11,30,11,34],[11,35,11,37],[25,0,26,17],[24,0,24,11],[0,30,0,39],[1,30,1,34],[1,35,1,37],[2,35,2,37],[3,35,3,37],[4,35,4,37],[5,35,5,37],[6,35,6,37],[7,35,7,37],[8,35,8,37],[9,35,9,37],[10,35,10,37],[19,6,23,11],[23,0,23,3],[18,10,18,11],[0,29,1,29],[17,6,17,11],[1,0,1,17],[2,0,2,17],[12,6,12,11],[12,0,12,5],[3,0,3,3],[4,0,4,3],[5,0,5,3],[6,0,6,3],[8,0,8,3],[9,0,9,3],[13,0,14,3],[14,29,14,30],[3,6,3,9],[9,10,9,11],[10,10,10,11],[11,10,11,11],[16,4,16,5],[15,4,15,5],[13,4,14,5],[11,4,11,5],[10,4,10,5],[9,4,9,5],[13,6,14,9],[23,4,23,5],[20,4,20,5],[18,4,18,5],[3,10,3,11],[4,10,4,11],[5,10,5,11],[6,10,6,11],[13,10,14,11],[8,4,8,5],[6,4,6,5],[5,4,5,5],[4,4,4,5],[3,4,3,5],[16,10,16,11],[15,10,15,11],[19,4,19,5]]}
["2023-04-28",null,null,null,null,null,null,null,null,null,null,null,null,null,null,null,null,"V2020.3",null,null,null,null,null,null,null,null,null,null,null,"NO.","Special Conditions",null,null,null,null,null,null,null,null,null,null,"Active/Not Active "]
["DelDOT Auxiliary Lane Worksheet",null,null,null,null,null,null,null,null,null,null,null,null,null,null,null,null,null,null,null,null,null,null,null,null,null,null,null,null,null,"Case",null,null,null,null,"Action ",null,null,"Control Cell","Notes ","Disable"]
["Roadway Information and Entrance ",null,null,null,null,null,null,null,null,null,null,null,null,null,null,null,null,null,null,null,null,null,null,null,null,null,null,null,null,1," Number of Lanes is >4 ",null,null,null,null,"No calculations & display additional analysis required ",null,null,{"$f":"IF(E9=\"> 4 Lanes\",\"Additional Analysis Required\",\"\")","v":""},"B21",null,"working from other cells"]
["Name of Project",null,null,null,null,null,"Date of Submittal",null,null,null,null,null,null,null,null,null,null,null,null,null,null,null,null,null,null,null,null,null,null,2,"Number of Lanes is =4",null,null,null,null,"LTL required on Bypass cell and block ADT ",null,null,{"$f":"IF(E9=\"4 lanes\",1,0)","v":0},"B22",null,"Working from other cells"]
["Maintenance Road No. (i.e. K234A)",null,null,null,null,null,"Road Name",null,null,null,null,null,null,null,null,null,null,null,null,null,null,null,null,null,null,null,null,null,null,3,"Number of legs in 4 ",null,null,null,null,"LTL required and block ADT ",null,null,{"$f":"IF(K9>3,\"Bypass Not Allowed\",0)","v":0},null,null,"Working from bypass tab"]
["Signalized / Unsignalized",null,null,null,null,null,"Posted Speed Limit",null,null,null,null,null,null,null,null,null,null,null,null,null,null,null,null,null,null,null,null,null,null,4,"ADT > 8000 … no bypass",null,null,null,null,"LTL required and block ADT ",null,null,{"$f":"IF(E11>8000,\"Bypass Lane not allowed\",\"\")","v":""},null,null,"Working from bypass tab"]
{"$rows_left_out":21}
{"sheet":"Left - Right Approach Example","index":2,"n_rows":0,"n_cols":0,"rows_kept":0,"cut":false,"hidden":false,"merged":[]}

{"sheet":"By Pass Lane","index":3,"n_rows":103,"n_cols":21,"rows_kept":103,"cut":false,"hidden":true,"merged":[[89,0,97,0],[89,2,89,8],[90,2,90,8],[91,1,97,1],[91,2,96,8],[69,0,77,0],[69,2,69,8],[70,2,70,8],[71,1,77,1],[71,2,76,8],[51,0,59,0],[51,2,51,8],[52,2,52,8],[53,1,59,1],[33,2,37,8],[54,2,58,8],[30,0,38,0],[30,2,30,8],[31,2,31,8],[32,1,38,1],[15,1,21,1],[13,0,21,0],[14,2,14,8],[13,2,13,8],[15,2,20,8]]}
[]
["Projected 10-Year Opposing Volume (vph)",{"$f":"'Aux Lane Inputs-Tab 2'!E20","v":""},null,null,"Roadway ADT",{"$f":"'Aux Lane Inputs-Tab 2'!E11","v":0},null,"Roadway ADT",{"$f":"IF(F2<1500,\"<1500\",IF(AND(F2>=1500,F2<=2000),\"1500-2000\",IF(AND(F2>2000,F2<=4000),\"2000-4000\",IF(AND(F2>4000,F2<=8000),\"4000-8000\",IF(F2>8000,\">8000\",\"ERROR\")))))","v":"<1500"},null,null,null,null,null,null,null,"0-100"]
["LTL VPH",{"$f":"'Aux Lane Inputs-Tab 2'!E14","v":0},null,null,"Number of legs",{"$f":"'Aux Lane Inputs-Tab 2'!K9","v":0},null,"LTL VPH",{"$f":"IF(B3<5,\"Less than 5\",IF(AND(B3>=5,B3<=9),\"5 to 9\",IF(AND(B3>=10,B3<=14),\"10 to 14\",IF(AND(B3>14,B3<=20),\"15-20\",IF(AND(B3>20,B3<=30),\"21-30\",IF(AND(B3>30,B3<=40),\"31-40\",IF(B3>40,\"Over 40\",\"ERROR\")))))))","v":"Less than 5"},null,null,null,null,null,null,null,"101-200"]
["Speed Limit",{"$f":"'Aux Lane Inputs-Tab 2'!K6","v":0},null,null,"Road Class",{"$f":"'Aux Lane Inputs-Tab 2'!E10","v":0},null,"Projected 10-Year Opposing Volume (vph)",{"$f":"IF(AND(B2>=0,B2<=100),\"0-100\",IF(AND(B2>100,B2<=200),\"101-200\",IF(AND(B2>200,B2<=300),\"201-300\",IF(AND(B2>300,B2<=400),\"301-400\",\">400\"))))","v":">400"},null,null,null,null,null,null,null,"201-300"]
[null,null,null,null,"No. of Lanes",{"$f":"'Aux Lane Inputs-Tab 2'!E9","v":0},null,null,null,null,null,null,null,null,null,null,"301-400"]
["Storage Length",{"$f":"IF(AND(B4=25,(K6=\"LTL\")),\"LTL Required\",IF(B4=25,\"Bypass not Required\",IF(B7=\"LTL Required\",\"LTL Required\",IF(K6=\"LTL\",\"LTL Required\",IF(AND(K6<>\"Bypass not required\",OR(F3=4,F5<>\"2 Lanes\")),\"Bypass not Allowed\",IF(U14=\"LTL\",\"LTL Required\",IF(B7=\"Bypass not Required\",\"Bypass not Required\",K6)))))))","v":"Bypass not required"},"IF(B4=25,\"Bypass not Required\",IF(B7=\"LTL Required\",\"LTL Required\",IF(K6=\"LTL\",\"LTL Required\",IF(OR(AND(F2>=4000,B3>=15),F3=4,F4=\"Other Freeway / Expressway\",F5<>\"2 Lanes\"),\"Bypass not Allowed\",IF(U14=\"LTL\",\"LTL Required\",IF(B7=\"Bypass not Required\",\"Bypass not Required\",IF(B3>=50,\"LTL Required\",K6)))))))",null,null,null,null,null,null,"Storage Length ",{"$f":"IF(I2=\"<1500\",K14,IF(I2=\"1500-2000\",K31,IF(I2=\"2000-4000\",K52,IF(I2=\"4000-8000\",K70,IF(I2=\">8000\",K90)))))","v":"Bypass not required"},null,null,null,null,null,">400"]
{"$rows_left_out":98}
{"sheet":"L+Calcs","index":4,"n_rows":171,"n_cols":83,"rows_kept":171,"cut":false,"hidden":true,"merged":[[104,2,104,13],[146,2,146,13],[159,2,159,13],[160,2,160,13],[117,2,117,13],[118,2,118,13],[131,2,131,13],[132,2,132,13],[145,2,145,13],[75,2,75,13],[76,2,76,13],[89,2,89,13],[90,2,90,13],[103,2,103,13],[0,46,0,51],[1,25,4,25],[1,26,1,37],[1,46,1,51],[5,44,5,45],[3,26,3,37],[4,44,4,45],[18,64,19,64],[18,65,19,65],[19,0,26,1],[19,44,19,45],[15,44,15,45],[16,0,16,8],[16,26,16,37],[16,44,16,45],[17,44,17,45],[15,0,15,8],[42,47,42,61],[41,46,43,46],[13,0,13,8],[13,44,13,45],[33,0,35,0],[33,2,33,13],[34,2,34,13],[14,44,14,45],[28,50,28,63],[29,50,29,63],[17,63,19,63],[18,0,18,8],[18,44,18,45],[27,0,28,1],[11,44,11,45],[12,44,12,45],[47,0,49,0],[15,25,17,25],[15,26,15,37],[29,26,29,37],[6,44,6,45],[7,44,7,45],[8,44,8,45],[9,44,9,45],[10,44,10,45],[61,0,63,0],[28,25,30,25],[28,26,28,37],[56,25,58,25],[56,26,56,37],[57,26,57,37],[43,26,43,37],[42,25,44,25],[42,26,42,37],[61,2,61,13],[62,2,62,13],[47,2,47,13],[48,2,48,13],[3,64,3,82],[126,25,128,25],[126,26,126,37],[127,26,127,37],[112,25,114,25],[112,26,112,37],[113,26,113,37],[85,26,85,37],[98,25,100,25],[98,26,98,37],[99,26,99,37],[70,25,72,25],[70,26,70,37],[71,26,71,37],[84,25,86,25],[84,26,84,37]]}
["2000-4000","Roadway ADT",4000,{"$f":"C1*('Aux Lane Inputs-Tab 2'!$E12/100)*('Aux Lane Inputs-Tab 2'!$K12/100)","v":{"$error":"#N/A"}},2000,{"$f":"E1*('Aux Lane Inputs-Tab 2'!$E12/100)*('Aux Lane Inputs-Tab 2'!$K12/100)","v":{"$error":"#N/A"}},null,null,null,null,null,null,null,null,null,null,null,null,null,null,null,null,null,null,null,"Critical Headway (sec) = 4.2",null,null,null,null,null,null,null,null,null,null,null,null,null,null,null,null,null,null,null,null,"Deceleration Length (feet) = Brake Reaction + Braking Distance"]
[null,"Critical Headway",{"$f":"IF('Aux Lane Inputs-Tab 2'!E9=\"2 lanes\",VLOOKUP('Aux Lane Inputs-Tab 2'!E17,AN5:AO11,2),IF('Aux Lane Inputs-Tab 2'!E9=\"4 lanes\",VLOOKUP('Aux Lane Inputs-Tab 2'!E17,'L+Calcs'!AN5:AP11,3)))","v":false},null,null,null,null,null,null,null,null,null,null,null,null,null,null,null,null,null,null,null,null,null,null,"Left-Turning Vehicles (in vph)","TRR 1500 - Lengths of Left-Turn Lanes at Unsignalized Intersections*",null,null,null,null,null,null,null,null,null,null,null,null,null,"Critical Headway, tc",null,null,null,null,null,"Posted Speed (mph)"]
[null,"Left Turn (vph)",{"$f":"'Aux Lane Inputs-Tab 2'!E14","v":0}]
[null,"Left Turn Rounded",{"$f":"IF(C3<5,0,((IF(AND(C3>=5,C3<=50,D5>D1),50,(IF(AND(C3>=20,C3<50,D5>=F1),50,(IF(AND(C3>=10,C3<50,F1>=D5>=D1),50,MROUND('Aux Lane Inputs-Tab 2'!E14,50)))))))))","v":0},null,null,null,null,null,null,null,null,null,null,null,null,null,null,null,null,null,null,null,null,null,null,null,"Opposing Volume (in vph)",null,null,null,null,null,null,null,null,null,null,null,null,"%HV","2 lanes","4 lanes",null,null,null,null,25,35,40,45,50,55,null,null,null,null,null,null,null,null,null,null,null,"Posted Speed (mph)/Grade","DECELERATION  (Feet)*"]
[null,"Opposing Volume Rounded",{"$f":"MROUND('Aux Lane Inputs-Tab 2'!E20,100)","v":{"$error":"#VALUE!"}},{"$f":"'Aux Lane Inputs-Tab 2'!E20","v":""},null,null,null,null,null,null,null,null,null,null,null,null,null,null,null,null,null,null,null,null,null,null,100,200,300,400,500,600,700,800,900,1000,1100,1200,null,5,4.2,4.2,null,null,"Brake reaction distance (ft)",null,44.1,58.8,58.8,66.150000000000006,73.5,80.849999999999994,null,null,null,null,null,null,null,null,null,null,null,"Grade",-1,-2,-3,-4,-5,-6,-7,-8,-9,0,1,2,3,4,5,6,7,8,9]
[null,"Speed Limit",{"$f":"'Aux Lane Inputs-Tab 2'!K6","v":0},null,null,null,null,null,null,null,null,null,null,null,null,null,null,null,null,null,null,null,null,null,null,50,1,1,1,2,2,2,2,2,2,3,3,3,null,10,4.2,4.3,null,null,"Braking distance downgrade 3% (ft)",null,94.391244870041064,128.47697218422255,128.47697218422255,167.80665754673967,212.3803009575924,262.19790241678072,null,null,null,null,null,null,null,null,null,null,null,25,131,131,139,142,145,149,153,157,161,131,131,131,124,122,120,118,116,115,113]
{"$rows_left_out":166}
{"sheet":"R>50+Calcs","index":5,"n_rows":594,"n_cols":19,"rows_kept":594,"cut":false,"hidden":true,"merged":[[566,1,569,1],[566,2,569,2],[566,3,569,3],[566,4,567,9],[535,2,538,2],[504,3,507,3],[504,4,505,9],[442,2,445,2],[442,3,445,3],[442,4,443,9],[563,1,563,9],[501,1,501,9],[502,1,502,9],[503,1,503,9],[535,3,538,3],[535,4,536,9],[532,2,532,9],[533,2,533,9],[534,1,534,9],[504,1,507,1],[504,2,507,2],[473,1,476,1],[473,2,476,2],[473,3,476,3],[473,4,474,9],[470,1,470,9],[472,1,472,9],[441,1,441,9],[442,1,445,1],[565,1,565,9],[439,2,439,9],[440,2,440,9],[410,1,410,9],[411,1,414,1],[411,2,414,2],[411,3,414,3],[411,4,412,9],[408,1,408,9],[409,1,409,9],[379,1,379,9],[285,1,285,9],[286,1,286,9],[318,1,321,1],[318,2,321,2],[380,2,383,2],[380,3,383,3],[380,4,381,9],[287,1,290,1],[287,2,290,2],[287,3,290,3],[287,4,288,9],[347,1,347,9],[316,1,316,9],[317,1,317,9],[318,3,321,3],[318,4,319,9],[348,1,348,9],[349,1,352,1],[349,2,352,2],[349,3,352,3],[349,4,350,9],[255,1,255,9],[256,1,259,1],[256,2,259,2],[256,3,259,3],[256,4,257,9],[253,1,253,9],[254,1,254,9],[224,1,224,9],[225,1,228,1],[225,2,228,2],[225,3,228,3],[225,4,226,9],[222,2,222,9],[191,1,191,9],[192,1,192,9],[162,1,162,9],[163,1,166,1],[223,2,223,9],[193,1,193,9],[194,1,197,1],[194,2,197,2],[194,3,197,3],[194,4,195,9],[97,1,97,9],[98,1,98,9],[99,1,99,9],[100,1,103,1],[100,2,103,2],[100,3,103,3],[100,4,101,9],[163,2,166,2],[163,3,166,3],[163,4,164,9],[159,1,159,9],[160,1,160,9],[128,2,128,9],[129,2,129,9],[130,1,130,9],[131,1,134,1],[131,2,134,2],[131,3,134,3],[131,4,132,9],[6,1,6,9],[7,1,10,1],[7,2,10,2],[68,1,68,9],[69,1,72,1],[69,2,72,2],[69,3,72,3],[69,4,70,9],[37,1,37,9],[38,1,41,1],[38,2,41,2],[38,3,41,3],[38,4,39,9],[66,1,66,9],[67,1,67,9],[7,3,10,3],[7,4,8,9],[35,1,35,9],[36,1,36,9]]}
[null,"Projected ADT",{"$f":"IF('Aux Lane Inputs-Tab 2'!K11<2000,E1,IF('Aux Lane Inputs-Tab 2'!K11<4000,E2,IF('Aux Lane Inputs-Tab 2'!K11<10000,E3,IF('Aux Lane Inputs-Tab 2'!K11>10000,E4,0))))","v":"Less Than 2,000"},null,"Less Than 2,000",null,"IF(A6>0,A6,IF(B6>0,B6,IF(C6>0,C6),IF(C6>0,C6,IF(D6>0,D6,IF(E6>0,E6,IF(F6>0,F6,IF(G6>0,G6,IF(H6>0,H6,IF(I6>0,I6,IF(J6>0,J6,IF(K6>0,K6,IF(L6>0,L6,IF(M6>0,M6,IF(N6>0,N6,IF(O6>0,O6,IF(P6>0,P6,IF(Q6>0,Q6,IF(R6>0,R6))))))))))))))))))",null,"If Heavy veh >=10%"]
[null,"RT Turn ADT",{"$f":"'Aux Lane Inputs-Tab 2'!K14","v":"0-50"},null,"2,000 to 4,000 Vehicles",null,"RTL Length",{"$f":"SUM(A6:S6)+I2","v":{"$error":"#N/A"}},{"$f":"IF(AND('Aux Lane Inputs-Tab 2'!E17>=10,SUM(A6:S6)>0),25,0)","v":{"$error":"#N/A"}},null,null,{"$f":"IF(-3<='Aux Lane Inputs-Tab 2'!K16*100<=3,0,'Aux Lane Inputs-Tab 2'!K16*100)","v":0}]
[null,"Posted SL",{"$f":"'Aux Lane Inputs-Tab 2'!K6","v":0},null,"4,001 to 10,000 Vehicles",null,null,null,{"$f":"IF(#REF!=\"RCP\",INDEX($BL$69:$BZ$89,MATCH(#REF!,$BL$69:$BL$89,),MATCH(#REF!,$BL$69:$BZ$69,)),IF(#REF!=\"ERCP\",INDEX($CA$69:$CN$89,MATCH(#REF!,$CA$69:$CA$89,),MATCH(#REF!,$CA$69:$CN$69,)),INDEX($BL$97:$BX$116,MATCH(#REF!,$BL$97:$BL$115,),MATCH(#REF!,$BL$97:$BX$97,))))","v":{"$error":"#REF!"}},"Example of Indexing"]
[null,"Roadway Slope",{"$f":"IF(-3<='Aux Lane Inputs-Tab 2'!K16*100<=3,0,ROUNDDOWN('Aux Lane Inputs-Tab 2'!K16*100,0))","v":0},{"$f":"ROUNDUP(C4,0)","v":0},"Over 10,000 Vehicles",{"$f":"C1&C2","v":"Less Than 2,0000-50"}]
[-1,-2,-3,-4,-5,-6,-7,-8,-9,0,1,2,3,4,5,6,7,8,9]
[{"$f":"M10","v":0},{"$f":"M41","v":0},{"$f":"M72","v":0},{"$f":"M103","v":0},{"$f":"M134","v":0},{"$f":"M166","v":0},{"$f":"M197","v":0},{"$f":"M228","v":0},{"$f":"M259","v":0},{"$f":"M290","v":{"$error":"#N/A"}},{"$f":"M321","v":0},{"$f":"M352","v":0},{"$f":"M383","v":0},{"$f":"M414","v":0},{"$f":"M445","v":0},{"$f":"M476","v":0},{"$f":"M507","v":0},{"$f":"M538","v":0},{"$f":"M569","v":0}]
{"$rows_left_out":589}
{"sheet":"R ≤ 50+Calcs","index":6,"n_rows":591,"n_cols":19,"rows_kept":591,"cut":false,"hidden":true,"merged":[[593,2,593,10],[594,2,594,10],[595,1,595,10],[596,1,596,10],[591,1,591,10],[592,1,592,10]]}
[null,"Projected ADT",{"$f":"IF('Aux Lane Inputs-Tab 2'!K11<2000,E1,IF('Aux Lane Inputs-Tab 2'!K11<4000,E2,IF('Aux Lane Inputs-Tab 2'!K11<10000,E3,IF('Aux Lane Inputs-Tab 2'!K11>10000,E4,0))))","v":"Less Than 2,000"},null,"Less Than 2,000",null,null,null,"If Heavy veh >=10%"]
[null,"RT Turn ADT",{"$f":"'Aux Lane Inputs-Tab 2'!K14","v":"0-50"},null,"2,000 to 4,000 Vehicles",null,"RTL Length",{"$f":"IF(C4>9,0,IF(C4<-9,0,SUM(A6:S6)+I2))","v":{"$error":"#N/A"}},{"$f":"IF(AND('Aux Lane Inputs-Tab 2'!E17>=10,SUM(A6:S6)>0),25,0)","v":{"$error":"#N/A"}},null,{"$f":"IF(2001<'R ≤ 50+Calcs'!C2>4000,'R ≤ 50+Calcs'!F2,0)","v":0}]
[null,"Posted SL",{"$f":"'Aux Lane Inputs-Tab 2'!K6","v":0},null,"4,001 to 10,000 Vehicles",null,null,null,{"$f":"IF(#REF!=\"RCP\",INDEX($BK$69:$BY$89,MATCH(#REF!,$BK$69:$BK$89,),MATCH(#REF!,$BK$69:$BY$69,)),IF(#REF!=\"ERCP\",INDEX($BZ$69:$CM$89,MATCH(#REF!,$BZ$69:$BZ$89,),MATCH(#REF!,$BZ$69:$CM$69,)),INDEX($BK$97:$BW$116,MATCH(#REF!,$BK$97:$BK$115,),MATCH(#REF!,$BK$97:$BW$97,))))","v":{"$error":"#REF!"}},"Example of Indexing"]
[null,"Roadway Slope",{"$f":"IF(-3<='Aux Lane Inputs-Tab 2'!K16*100<=3,0,ROUNDDOWN('Aux Lane Inputs-Tab 2'!K16*100,0))","v":0},{"$f":"ROUNDUP(C4,0)","v":0},"Over 10,000 Vehicles",{"$f":"C1&C2","v":"Less Than 2,0000-50"}]
[-1,-2,-3,-4,-5,-6,-7,-8,-9,0,1,2,3,4,5,6,7,8,9]
[{"$f":"M10","v":0},{"$f":"M41","v":0},{"$f":"M72","v":0},{"$f":"M103","v":0},{"$f":"M134","v":0},{"$f":"M165","v":0},{"$f":"M196","v":0},{"$f":"M227","v":0},{"$f":"M258","v":0},{"$f":"M289","v":{"$error":"#N/A"}},{"$f":"M319","v":0},{"$f":"M349","v":0},{"$f":"M380","v":0},{"$f":"M411","v":0},{"$f":"M442","v":0},{"$f":"M473","v":0},{"$f":"M504","v":0},{"$f":"M535","v":0},{"$f":"M566","v":0}]
{"$rows_left_out":586}
{"sheet":"Left Turn Lane-Tab 3","index":7,"n_rows":39,"n_cols":14,"rows_kept":39,"cut":false,"hidden":false,"merged":[[31,0,32,1],[31,9,31,13],[31,2,31,8]]}
[]
[]
[]
[]
[]
[]
{"$rows_left_out":34}
{"sheet":"Bypass Lane-Tab 4","index":8,"n_rows":33,"n_cols":8,"rows_kept":33,"cut":false,"hidden":false,"merged":[[23,0,25,0],[22,0,22,1],[22,2,22,3],[22,4,22,5],[19,0,20,0],[19,3,20,3],[23,1,25,2],[19,1,20,1],[19,2,20,2],[1,0,1,7],[14,0,18,0],[2,0,9,0],[2,1,9,1],[2,2,3,7],[10,0,11,0],[10,1,11,1],[10,2,11,2],[12,0,13,0],[12,1,13,1],[12,2,13,2],[12,3,13,3],[12,4,13,4],[18,6,19,7],[12,7,17,7],[4,2,8,2],[32,1,32,2],[23,6,25,7],[26,6,26,7],[27,6,27,7],[28,6,28,7],[29,6,29,7],[30,6,30,7],[31,6,31,7],[32,6,32,7],[29,1,29,2],[30,1,30,2],[31,1,31,2],[26,1,26,2],[27,1,27,2],[28,1,28,2],[23,5,25,5],[4,3,8,3],[4,4,8,4],[4,5,8,5],[4,6,8,6],[4,7,8,7],[9,2,9,7],[10,5,11,5],[10,6,11,6],[10,7,11,7],[12,5,13,5],[12,6,13,6],[10,3,11,3],[10,4,11,4]]}
[]
["Figure 5.2.9.2-a Bypass Lane Warrants"]
["Projected 10-year Roadway AADT","Projected 10-\nYear \nOpposing \nVolume (vph)","Left-Turning Vehicles (vph)"]
[]
[null,null,"Less than 10","10-14","15-20","21-30","31-40","Over 40"]
[]
{"$rows_left_out":28}
{"sheet":"Right Turn Lane R ≤ 50-Tab 5","index":9,"n_rows":26,"n_cols":9,"rows_kept":26,"cut":false,"hidden":false,"merged":[[2,0,2,8],[7,0,9,0],[25,0,39,8],[10,0,13,0],[14,0,18,0],[19,0,23,0],[4,0,6,0],[4,1,6,1],[4,2,6,2],[4,3,4,8],[6,3,6,8]]}
[]
[]
["Figure 5.2.9.1-a Right Turn Lane Warrants (R<50’)"]
[]
["Projected 10-Year Roadway ADT","Right-turn ADT","Assumed Speed\nChange on\nThrough Lane","Highway Posted Speed"]
[null,null,null,"25 MPH","35 MPH","40 MPH","45 MPH","50 MPH","55 MPH"]
{"$rows_left_out":21}
{"sheet":"Right Turn Lane R > 50-Tab 6","index":10,"n_rows":26,"n_cols":9,"rows_kept":26,"cut":false,"hidden":false,"merged":[[7,0,9,0],[10,0,13,0],[14,0,18,0],[19,0,23,0],[25,0,39,9],[2,0,2,8],[4,0,6,0],[4,1,6,1],[4,2,6,2],[4,3,4,8],[6,3,6,8]]}
[]
[]
["Figure 5.2.9.1-b Right Turn Lane Warrants (R>50’)"]
[]
["Projected 10-Year Roadway ADT","Right-turn ADT","Assumed Speed\nChange on\nThrough Lane","Highway Posted Speed"]
[null,null,null,"25 MPH","35 MPH","40 MPH","45 MPH","50 MPH","55 MPH"]
{"$rows_left_out":21}
{"sheet":"Signalized Intersection-Tab 7","index":11,"n_rows":63,"n_cols":9,"rows_kept":63,"cut":false,"hidden":false,"merged":[[43,0,43,1],[43,2,43,4],[43,7,43,8],[44,0,44,1],[44,2,44,4],[44,7,44,8],[48,0,48,8],[50,0,50,8],[45,0,45,1],[45,2,45,4],[45,6,46,7],[45,8,46,8],[40,0,40,8],[18,2,18,4],[14,1,14,2],[12,7,12,8],[15,0,15,8],[16,0,17,4],[16,6,16,8],[17,7,17,8],[18,0,18,1],[31,0,31,8],[27,0,27,1],[23,0,23,8],[0,0,0,8],[1,0,1,8],[5,0,7,3],[8,0,8,2],[9,0,9,2],[3,1,3,7],[5,6,6,6],[5,7,6,8],[7,7,7,8],[8,7,8,8],[9,7,9,8],[58,0,58,2],[52,0,52,8],[27,2,27,4],[27,7,27,8],[28,0,28,1],[28,2,28,4],[28,6,29,7],[28,8,29,8],[42,7,42,8],[36,6,37,6],[41,0,42,4],[41,6,41,8],[36,0,38,3],[39,7,39,8],[36,7,37,8],[38,7,38,8],[59,0,59,2],[60,0,60,2],[62,0,62,8],[19,0,19,1],[54,0,54,8],[56,0,57,2],[56,3,56,8],[24,0,25,4],[24,6,24,8],[25,7,25,8],[26,0,26,1],[26,2,26,4],[26,7,26,8],[34,0,34,8],[19,2,19,4],[19,7,19,8],[10,7,10,8],[11,7,11,8],[18,7,18,8],[20,0,20,1],[20,2,20,4],[20,6,21,7],[20,8,21,8]]}
[]
["LEFT-TURN LANE LENGTH AT SIGNALIZED INTERSECTIONS"]
[]
[null,"Requires more detailed coordination with the Traffic Impact Studies Group within the DelDOT: Development Coordination Section"]
[]
["From the Highway Capacity Manual 2010 (HCM 2010) / Highway Capacity Software 2010 (HCS 2010) determine the Left-Turn 95% QUEUE (Veh) and the Left-Turn 50% QUEUE (Veh)",null,null,null,null,null,"Posted Speed (mph)","DECELERATION  (Feet)*"]
{"$rows_left_out":58}
{"sheet":"Drop Lists - K&D factors - Msgs","index":12,"n_rows":28,"n_cols":22,"rows_kept":28,"cut":false,"hidden":true,"merged":[[0,10,0,13],[15,10,17,13],[0,1,1,7]]}
[null,"Drop lists ",null,null,null,null,null,null,null,null,"Critical Headway, tc"]
[null,null,null,null,null,null,null,null,null,null,null,"2 lanes","4 lanes","> 4 Lanes"]
[null,"Posted Speed","Roadway ADT","RT ADT","Funct Class","Intersection Legs","Radius","Proposed entrance ",null,null,"%HV",null,null,null,null,null,null,null,"0-50"]
[null,null,null,null,null,null,null,null,null,null,null,null,null,null,null,null,null,null,"51 - 100",null,null,{"$f":"'Traffic Generation Input Tab-1'!I22","v":0}]
[null,25,"Less Than 2,000","0-50","Interstate",3,"R≤50'","Proposed Entrance 1",null,null,5,{"$f":"(4.1+(1*K5/100))","v":4.1499999999999995},{"$f":"(4.1+(2*K5/100))","v":4.1999999999999993},null,null,null,null,null,"101 - 200"]
[null,30,"2,000 to 4,000 Vehicles","51 - 100","Other Freeway / Expressway",4,"R>50'","Proposed Entrance 2",null,null,10,4.1999999999999993,4.3,null,null,null,null,null,"201 - 300"]
{"$rows_left_out":22}